program: Orca
programVersion: 5.0.2
elementType: O O O O O N N N N N N N N C C C C C C C C C C C C C C C C C H H H H H H H H H H H H H H H H H H H H H H H H H H
charge: 0
multiplicity: 1
keywords: wb97x-d3
keywords: def2-TZVPP
keywords: def2/J RIJCOSX
keywords: DEFGRID2
keywords: scfconv7
keywords: smallprint printgap noloewdin
keywords: NOSOSCF
formula: C17H26N8O5
InChI: InChI=1/C17H26N8O5/c1-24(16(20)21)6-4-9(18)8-12(26)22-10-2-3-13(30-14(10)15(27)28)25-7-5-11(19)23-17(25)29/h2-3,5,7,9-10,13-14,20,22,27H,4,6,8,18-19,21H2,1H3
56 atoms
O  0.629512 -1.45999 0.68276
O  -3.37554 -2.302525 1.061379
O  -0.27413 -4.882944 0.936182
O  1.707476 -4.004134 0.434073
O  1.955418 1.75864 -0.098247
N  -2.091444 -1.435622 -0.584952
N  2.442721 -0.446487 -0.346689
N  -2.692411 1.06451 -1.508908
N  -2.196647 3.946401 0.644274
N  4.127084 1.161448 0.064557
N  0.100823 3.836462 1.006888
N  -0.829007 3.256836 -1.076334
N  6.304265 0.554186 0.214232
C  -1.156729 -2.528693 -0.632753
C  -0.237396 -2.554615 0.607046
C  -3.213278 1.14371 -0.150073
C  1.036212 -0.787251 -0.487383
C  -3.974913 -0.139345 0.203102
C  -0.275865 -2.358243 -1.836519
C  -4.07488 2.379437 0.119435
C  0.769721 -1.548588 -1.750707
C  -3.127414 -1.402197 0.281217
C  -3.37395 3.709858 -0.160349
C  0.533636 -3.865027 0.642035
C  3.369857 -1.431502 -0.34473
C  2.817307 0.898689 -0.116005
C  -2.392897 4.311229 2.022218
C  -0.952833 3.639939 0.144231
C  4.679964 -1.164481 -0.172833
C  5.019983 0.205808 0.037201
H  -1.702546 -3.474621 -0.672681
H  -0.868415 -2.520611 1.499475
H  -2.337757 1.199002 0.506143
H  0.512214 0.171426 -0.540013
H  -4.773867 -0.304514 -0.529858
H  -4.469311 -0.036047 1.169784
H  -0.51605 -2.87457 -2.756675
H  -4.420615 2.358941 1.158907
H  -4.981116 2.333959 -0.496916
H  -2.004811 -0.62532 -1.213925
H  1.41424 -1.353087 -2.599022
H  -4.081608 4.523831 0.023519
H  -3.084929 3.781439 -1.207099
H  -3.44146 1.16127 -2.184789
H  -2.023361 1.829956 -1.645478
H  3.002867 -2.439849 -0.46946
H  -1.704781 5.099715 2.332426
H  -3.398773 4.710785 2.141269
H  -2.298028 3.472949 2.723864
H  5.412948 -1.956848 -0.175409
H  0.244867 -5.698079 0.939259
H  -0.073324 3.733021 1.991321
H  0.947515 3.36075 0.725407
H  0.13848 3.070452 -1.301665
H  6.521105 1.517391 0.397359
H  7.03695 -0.126828 0.263346
totalener: -1477.81913217 hartree
nucrepener: 3194.89213053 hartree
electener: -4672.71126270 hartree
oneelecener: -8372.01905793 hartree
twoeener: 3699.30779522 hartree
kineticenergy: 1471.74530631 hartree
xcener: -138.845135593461 hartree
chargesum: 0.0000000
charge: -0.319654 -0.421563 -0.246936 -0.369494 -0.488422 -0.287855 -0.085584 -0.381318 -0.134126 -0.329050 -0.321116 -0.486279 -0.241914 0.262183 0.082229 0.114897 0.203903 -0.161021 -0.286378 -0.175328 -0.123620 0.278557 -0.083115 0.303135 0.019235 0.338660 -0.220682 0.306137 -0.261829 0.315903 0.114251 0.132910 0.079015 0.095428 0.078849 0.083267 0.117163 0.063243 0.071263 0.187798 0.120900 0.091534 0.100385 0.106897 0.189042 0.168176 0.112312 0.089837 0.106570 0.112022 0.200108 0.131870 0.196857 0.131247 0.167686 0.151814
qa: -0.3197 -0.4216 -0.2469 -0.3695 -0.4884 -0.2879 -0.0856 -0.3813 -0.1341 -0.3290 -0.3211 -0.4863 -0.2419 0.2622 0.0822 0.1149 0.2039 -0.1610 -0.2864 -0.1753 -0.1236 0.2786 -0.0831 0.3031 0.0192 0.3387 -0.2207 0.3061 -0.2618 0.3159 0.1143 0.1329 0.0790 0.0954 0.0788 0.0833 0.1172 0.0632 0.0713 0.1878 0.1209 0.0915 0.1004 0.1069 0.1890 0.1682 0.1123 0.0898 0.1066 0.1120 0.2001 0.1319 0.1969 0.1312 0.1677 0.1518
va: 2.0296 2.1015 2.2219 2.1067 2.0232 3.1232 3.2156 2.9946 3.0369 3.0230 3.1551 2.9595 3.2308 3.6526 3.9475 3.8119 4.0138 3.8659 3.9805 3.8732 3.8096 4.2541 3.8550 4.2526 4.0467 4.4301 3.9225 4.2107 3.9271 4.1046 1.0352 1.0369 1.0039 1.0382 1.0168 1.0357 1.0063 1.0140 1.0211 1.0756 1.0134 1.0020 1.0468 1.0423 1.0812 1.0231 0.9990 1.0034 0.9785 1.0143 1.0458 1.0347 1.0532 1.0491 1.0297 1.0279
dispcorr: -0.033765919 hartree
energy: -1477.852898090602
dipole: -20.01247 21.29941 1.28694 19.75027 -20.42853 -0.67827 -0.29323 0.16596 -0.12727
magnitude: 1.46029 au
magnitude: 3.71177 debye
