program: Orca
programVersion: 5.0.2
elementType: O O O O O N N N N N N N N C C C C C C C C C C C C C C C C C H H H H H H H H H H H H H H H H H H H H H H H H H H
charge: 0
multiplicity: 1
keywords: wb97x-d3
keywords: def2-TZVPP
keywords: def2/J RIJCOSX
keywords: DEFGRID2
keywords: scfconv7
keywords: smallprint printgap noloewdin
keywords: NOSOSCF
formula: C17H26N8O5
InChI: InChI=1/C17H26N8O5/c1-24(16(20)21)6-4-9(18)8-12(26)22-10-2-3-13(30-14(10)15(27)28)25-7-5-11(19)23-17(25)29/h2-3,5,7,9-10,13-14,20,22,27H,4,6,8,18-19,21H2,1H3
56 atoms
O  1.921108 -0.69174 -0.698025
O  -2.103105 -0.024765 1.781229
O  -1.195634 0.695558 -1.410618
O  0.664755 1.633021 -0.577663
O  4.670335 -3.550882 -0.940197
N  -1.47137 -1.648971 0.347884
N  3.909153 -1.613088 -0.059266
N  -5.039991 -0.329643 2.343195
N  -4.451194 3.200055 -1.123353
N  6.154952 -2.294631 0.233295
N  -3.240648 5.171999 -1.054961
N  -2.143846 3.10851 -1.229278
N  7.58719 -1.049493 1.474015
C  -0.054579 -1.422538 0.481664
C  0.527039 -0.752801 -0.780276
C  -4.846516 -0.042779 0.93346
C  2.593676 -1.908812 -0.635101
C  -3.796879 -0.998864 0.366629
C  0.688395 -2.701606 0.723992
C  -4.583168 1.438759 0.619722
C  1.882888 -2.933457 0.199456
C  -2.392091 -0.818258 0.909278
C  -4.56105 1.774686 -0.868496
C  0.01898 0.676749 -0.916875
C  4.117424 -0.521235 0.703664
C  4.937424 -2.560858 -0.290972
C  -5.662008 3.979833 -1.042327
C  -3.225884 3.795415 -1.11715
C  5.327917 -0.280825 1.25258
C  6.353212 -1.231395 0.96619
H  0.075835 -0.752807 1.336489
H  0.209906 -1.334386 -1.659991
H  -5.783564 -0.315488 0.431738
H  2.773963 -2.312029 -1.639081
H  -3.754829 -0.917775 -0.723728
H  -4.123494 -2.019724 0.586287
H  0.204748 -3.441466 1.351267
H  -3.64774 1.760177 1.078985
H  -5.384846 2.017337 1.093804
H  -1.76662 -2.207009 -0.43736
H  2.397386 -3.873015 0.348428
H  -5.482013 1.428044 -1.34657
H  -3.74847 1.263345 -1.37801
H  -4.221782 -0.042412 2.864254
H  -5.824103 0.198118 2.702543
H  3.284377 0.153492 0.832679
H  -5.882416 4.357184 -0.035807
H  -5.632994 4.823144 -1.731687
H  -6.502484 3.354966 -1.338675
H  5.495859 0.596918 1.85787
H  -1.610482 1.636383 -1.366104
H  -3.930283 5.613422 -0.471008
H  -2.336827 5.605585 -0.98107
H  -1.304497 3.664664 -1.143327
H  8.313361 -1.684065 1.194581
H  7.842992 -0.199992 1.938601
totalener: -1477.81718752 hartree
nucrepener: 3057.95551808 hartree
electener: -4535.77270560 hartree
oneelecener: -8097.82552079 hartree
twoeener: 3562.05281519 hartree
kineticenergy: 1471.73960105 hartree
xcener: -138.841321922244 hartree
chargesum: -0.0000000
charge: -0.319764 -0.425223 -0.374015 -0.373983 -0.414694 -0.230239 -0.093107 -0.339820 -0.142084 -0.331686 -0.281633 -0.444827 -0.249212 0.160988 0.120192 0.137534 0.207864 -0.222070 -0.221476 -0.179320 -0.173764 0.317810 -0.112434 0.309539 0.039496 0.300285 -0.218930 0.352302 -0.265846 0.314566 0.108968 0.090087 0.071034 0.115778 0.098243 0.119384 0.121142 0.113861 0.060674 0.126859 0.141732 0.092798 0.106271 0.134636 0.102377 0.141141 0.101510 0.120048 0.096697 0.107348 0.267220 0.147691 0.134149 0.121799 0.164512 0.147591
qa: -0.3198 -0.4252 -0.3740 -0.3740 -0.4147 -0.2302 -0.0931 -0.3398 -0.1421 -0.3317 -0.2816 -0.4448 -0.2492 0.1610 0.1202 0.1375 0.2079 -0.2221 -0.2215 -0.1793 -0.1738 0.3178 -0.1124 0.3095 0.0395 0.3003 -0.2189 0.3523 -0.2658 0.3146 0.1090 0.0901 0.0710 0.1158 0.0982 0.1194 0.1211 0.1139 0.0607 0.1269 0.1417 0.0928 0.1063 0.1346 0.1024 0.1411 0.1015 0.1200 0.0967 0.1073 0.2672 0.1477 0.1341 0.1218 0.1645 0.1476
va: 2.0407 2.0678 2.0909 2.1332 2.0791 3.1976 3.2157 3.0815 3.1189 3.0260 3.1695 3.0351 3.2132 3.7204 3.9192 3.9923 4.0378 3.8034 3.9904 3.8379 3.8439 4.1647 3.8668 4.3013 4.0596 4.4823 3.9179 4.1768 3.8858 4.0953 1.0477 1.0260 1.0077 1.0133 1.0107 1.0285 1.0179 1.0359 1.0260 1.0421 1.0194 1.0064 1.0155 1.0434 1.0427 1.0309 0.9797 1.0012 1.0029 1.0156 1.0738 1.0256 1.0415 1.0495 1.0322 1.0294
dispcorr: -0.031406603 hartree
energy: -1477.848594126718
dipole: -38.28941 35.69044 -2.59898 16.52670 -13.60142 2.92528 2.84485 -2.35195 0.49289
magnitude: 3.94397 au
magnitude: 10.02477 debye
