program: Gaussian 09
title: 000066139
version: EM64L-G09RevD.01
frameworkgroup: C1[X(C13H10O2)]
method: RPBEPBE
basis: SDD
operation: Freq
keyword: #pfreq=noraman
keyword: PBEPBE/SDD
title: #p freq=noraman PBEPBE/SDD
converged: YES YES NO NO
title: Mulliken charges:
elementType: O O C C C C C C C C C C C C C H H H H H H H H H H
charge: -0.297901 -0.214059 0.337287 0.343486 -0.341607 -0.366781 0.388645 -0.361737 -0.334481 -0.363723 -0.378691 -0.201016 -0.192043 -0.245001 -0.209380 0.270938 0.262963 0.235616 0.275510 0.267567 0.260283 0.233120 0.233910 0.234105 0.162991
chargesum: 0.00000
title: Mulliken charges with hydrogens summed into heavy atoms:
elementType: O O C C C C C C C C C C C C C
charge: -0.297901 -0.214059 0.337287 0.343486 -0.070669 -0.103818 0.388645 -0.126121 -0.058971 -0.096156 -0.118408 0.032104 0.041866 -0.010896 -0.046389
polarizability: 2.55902739e+02 -1.87004855e+00 1.23395709e+02 -1.22546732e+01 -4.70160327e-01 8.34169182e+01
1716.lowfreq: -12.6284 -2.5534 0.0004 0.0008 0.0008 5.1628 25.3871 43.7455 75.6460
frequency: 25.0038 43.7025 75.6407 102.5397 171.8868 189.2820 225.0605 301.1100 313.5562 355.8846 410.5935 421.0471 435.7939 487.2701 503.7417 583.7746 603.9075 614.8469 642.9665 692.8399 717.6018 729.6323 769.9751 817.1498 828.4799 841.5977 849.0648 855.2802 913.5461 954.8967 971.8078 985.2059 987.6697 991.7289 1000.0346 1001.3075 1019.1397 1076.1186 1111.0085 1151.7205 1167.6626 1171.6769 1183.4784 1215.9749 1230.2651 1293.0660 1307.8096 1360.0125 1382.4542 1403.0274 1427.3432 1441.3119 1470.1969 1489.6763 1566.7480 1595.2050 1599.3715 1613.1949 1621.8051 2863.7571 3123.0994 3133.8550 3143.1300 3149.9038 3157.1075 3166.1494 3167.9966 3173.2852 3176.5295
redmass: 5.4248 4.6653 4.5793 7.4919 7.7005 3.3615 5.1002 5.0103 3.5472 5.9609 2.9116 2.9515 6.1092 3.8826 2.7324 6.3347 6.0211 6.6835 6.4707 2.2885 4.3750 3.2779 1.7954 3.7851 1.4478 1.2590 1.4107 5.8837 1.4128 1.3793 1.3692 1.4540 6.2666 1.3062 2.7241 1.5792 2.1134 1.5080 1.2889 2.1196 1.2006 1.0791 1.4073 2.6398 4.6636 1.3031 1.3387 2.3031 7.0757 2.0079 4.3353 2.2654 2.2520 2.6064 7.9616 6.2067 6.4869 6.4591 6.8015 1.0845 1.0897 1.0852 1.0891 1.0888 1.0934 1.0966 1.0944 1.0969 1.1005
irintensity: 0.9590 0.7579 0.1786 5.0385 6.9988 6.6949 0.2217 4.2971 3.0164 10.4113 0.3712 0.8873 3.4859 13.2155 27.1092 4.7601 3.9824 3.4102 8.7284 27.7016 20.3254 19.5813 67.1988 15.2591 22.7346 7.2793 40.2972 62.0696 6.2599 1.5126 0.4452 2.0223 3.8834 0.5137 3.0130 4.9338 14.6204 11.8391 16.0976 4.8970 141.1684 12.8427 32.8605 49.9347 578.8412 7.2947 2.5064 2.9717 0.5567 20.1817 33.8762 5.9100 173.9179 79.0031 191.4736 105.1639 235.8312 130.3637 15.7497 131.2961 9.8616 1.6443 8.9881 0.4603 26.7932 10.2110 6.8010 3.6278 8.1529
temp: 298.150 k
press: 1.00000 atm
elementType: 8 8 6 6 6 6 6 6 6 6 6 6 6 6 6 1 1 1 1 1 1 1 1 1 1
symmnumber: 1
zpe: 499850.7 jmol-1
zpe.correction: 0.190383 hartree
zpe.thermalcorrener: 0.202639 hartree
zpe.thermalcorrenthalpy: 0.203583 hartree
zpe.thermalcorrgfe: 0.150201 hartree
zpe.sumelectzpe: -650.774876 hartree
zpe.sumelectthermal: -650.762620 hartree
zpe.sumelectthermalent: -650.761676 hartree
zpe.sumelectthermalfe: -650.815058 hartree
dipole: 5.1264 -1.6750 -0.6954
dipole: 5.4378
quadrupole: -104.8794 -79.5667 -85.9808
quadrupole: -0.8005 -0.3282 -0.5352
quadrupole: -14.7371 10.5756 4.1615 -0.8005 -0.3282 -0.5352
hfenergy: -650.965259 hartree
pointgroup: C01 [X(C13H10O2)]
dipole: 2.0006303 -0.6935968 -0.3055074 debye
dipolederiv: -2.6017319 0.0933585 -0.0788556 -0.0094492 -0.3772201 -0.0323112 0.2482625 -0.0552028 -0.2208168 -1.4316382 -0.0339885 0.0119163 0.356529 -0.3955564 -0.0468527 0.2694215 -0.0343335 -0.368299 2.0727667 0.0977112 0.1313174 0.693864 0.2062569 0.1224121 0.0563386 0.0991911 0.1770459 1.5730932 -0.2690578 -0.0213886 -0.8361117 0.2492356 -0.078774 -0.3414165 -0.0177629 0.112177 -0.4541648 -0.0761343 -0.0689231 -0.5589756 -0.1955946 -0.0278736 -0.2780732 -0.0121972 -0.1659858 -0.7344111 0.015055 -0.0196689 0.1928411 0.0281162 0.109601 0.0729918 0.1061478 -0.1132834 -1.1335373 -0.14518 -0.0650224 -0.4469574 -0.2135355 -0.1256646 -0.1917973 -0.1204407 -0.0796573 0.5320488 0.0779581 0.0246378 -0.0318584 0.0455583 0.1135038 -0.0672171 0.1008268 -0.0678944 0.3172205 -0.003843 -0.0083178 0.268588 0.0661308 0.0979864 0.1420287 0.0942323 -0.0366601 -0.2825777 0.0153003 -0.0556881 0.2689772 -0.1552828 -0.0315203 -0.0971239 -0.0109517 -0.1060072 -0.3871237 0.0328624 -0.0263495 0.00811 0.01152 -0.052655 0.0521938 -0.0900715 -0.1114551 0.061842 -0.0231573 -0.0573402 -0.0721631 0.0837439 -0.10928 -0.0461599 -0.1165079 -0.0479028 0.087006 -0.0094035 -0.0863465 0.0075112 0.0075182 -0.0959593 -0.1275334 -0.0810964 -0.049216 -0.0437724 -0.1003887 -0.0247112 -0.0698236 -0.0885675 -0.003695 -0.0016379 -0.0058518 -0.1649767 2.0605769 0.1648415 0.0380752 0.1831374 0.578161 0.2872993 0.0169192 0.2826772 0.2741422 0.0211425 0.0511624 0.0494972 0.0788588 0.0688938 -0.0452705 0.0982168 -0.0434703 0.123226 0.0939195 -0.0482977 -0.0195005 -0.0416038 0.0199952 -0.0877307 -0.0181368 -0.0858429 0.1148555 0.0660561 -0.0472542 -0.0307768 -0.0285149 -0.0143043 -0.1039039 -0.0284856 -0.0966018 0.0895122 0.03777 0.0731689 0.0479208 0.0232982 0.0789738 -0.0462325 0.0260987 -0.0445311 0.1242132 0.0228574 -0.0296029 0.089189 -0.045408 0.0891195 0.0388197 0.1321983 0.033524 0.0986168 0.1361869 0.0457354 0.0071566 0.0428597 0.0017123 0.0855243 0.0039536 0.0812602 0.1132794 0.0673756 0.0244997 0.0079163 0.0573607 -0.0403258 0.1125892 -0.0077421 0.1082243 0.0859764 -0.0457206 -0.0461875 0.0937986 -0.0451915 0.0741161 0.0689965 0.1109952 0.0652859 0.0796416 -0.0708995 0.0961275 0.0305044 0.110801 0.0575396 0.0264788 0.038722 0.0219535 0.1416523 0.0357149 0.0447147 0.0309595 -0.1066793 -0.1862039 -0.175488 -0.063017 -0.1784607 -0.0021838 unknown
polarizability: 256.1203971|-5.1316816|123.210283|-8.9267388|4.2075129|83.3846868 unknown
InChI: InChI=1S/C13H10O2/c14-10-11-6-8-13(9-7-11)15-12-4-2-1-3-5-12/h1-10H
charge 0 multiplicity 1
25 atoms
O  0.845821 1.183279 0.314634
O  -5.521439 -0.067182 -0.032787
C  -0.437249 0.641351 0.125558
C  2.018126 0.384265 0.179979
C  -0.68959 -0.558195 -0.587012
C  -1.502226 1.422624 0.646317
C  -3.10217 -0.207589 -0.24696
C  -2.023471 -0.970775 -0.766945
C  -2.824741 0.99746 0.459829
C  2.164065 -0.843643 0.864654
C  3.072926 0.937034 -0.574896
C  3.393326 -1.533321 0.771194
C  4.298162 0.237807 -0.655341
C  4.461219 -0.999005 0.011671
C  -4.492767 -0.667954 -0.450517
H  0.136643 -1.142766 -1.001245
H  -1.261759 2.344677 1.183466
H  -2.233502 -1.893392 -1.322814
H  -3.667506 1.576711 0.852267
H  1.342207 -1.241149 1.468829
H  2.924371 1.896933 -1.078236
H  3.517767 -2.483414 1.302019
H  5.122771 0.66009 -1.239585
H  5.412268 -1.537777 -0.053403
H  -4.587154 -1.626066 -1.024374
