program: Gaussian 09
title: 000066111
version: EM64L-G09RevD.01
frameworkgroup: C1[X(C5H10Si)]
method: RPBEPBE
basis: SDD
operation: Freq
keyword: #pfreq=noraman
keyword: PBEPBE/SDD
title: #p freq=noraman PBEPBE/SDD
converged: YES YES NO NO
title: Mulliken charges:
elementType: Si C C C C C H H H H H H H H H H
charge: 1.282458 -1.012458 -1.012497 -1.012518 -0.222079 -0.460866 0.244564 0.244442 0.232765 0.232763 0.244490 0.244500 0.244453 0.244551 0.232770 0.272661
chargesum: 0.00000
title: Mulliken charges with hydrogens summed into heavy atoms:
elementType: Si C C C C C
charge: 1.282458 -0.290687 -0.290744 -0.290743 -0.222079 -0.188206
polarizability: 9.35077108e+01 -3.48791727e-03 6.64506977e+01 5.90895512e-03 -2.19152648e-05 6.64337313e+01
1716.lowfreq: -20.2059 -6.3165 -0.0004 0.0008 0.0009 7.4115 119.0136 119.9655 123.1408
frequency: 119.0107 119.9640 123.1177 141.8506 151.4201 195.9912 198.7664 214.8997 350.1555 350.4088 527.8935 635.7057 674.7761 674.7901 698.6710 699.3617 745.7449 822.1663 823.5232 908.6412 909.2994 927.7322 1296.2642 1297.4617 1309.6725 1437.9859 1445.8973 1446.5305 1450.9487 1451.7043 1462.6508 2049.0551 2985.8570 2986.0967 2986.9442 3089.1137 3089.2649 3091.5526 3095.3246 3096.4572 3096.7499 3408.6351
redmass: 2.1339 2.7492 1.1816 1.0522 1.0458 2.4903 2.4766 2.5897 4.7148 4.7157 5.1556 4.5497 1.2831 1.2820 3.1849 3.1704 1.1664 1.3424 1.3434 1.4955 1.4933 1.5351 1.2000 1.1999 1.1876 1.0547 1.0537 1.0535 1.0484 1.0483 1.0465 5.9618 1.0341 1.0341 1.0339 1.0986 1.0986 1.0978 1.0991 1.0985 1.0984 1.1555
irintensity: 0.3131 0.3711 0.0653 0.0036 0.0063 0.0854 0.0858 1.5531 22.3417 22.3948 13.5132 28.9737 57.8454 58.1690 17.9606 17.3179 0.0083 26.9983 27.9036 93.8119 93.5361 194.1747 39.7281 40.2286 8.7502 0.0085 0.1445 0.0713 10.3441 10.4250 15.8537 8.2029 13.8838 13.8991 11.2939 2.1243 2.1994 46.3690 1.7103 21.1147 22.5197 41.2257
temp: 298.150 k
press: 1.00000 atm
elementType: 14 6 6 6 6 6 1 1 1 1 1 1 1 1 1 1
symmnumber: 1
zpe: 338471.7 jmol-1
zpe.correction: 0.128917 hartree
zpe.thermalcorrener: 0.138806 hartree
zpe.thermalcorrenthalpy: 0.139750 hartree
zpe.thermalcorrgfe: 0.094955 hartree
zpe.sumelectzpe: -485.404597 hartree
zpe.sumelectthermal: -485.394708 hartree
zpe.sumelectthermalent: -485.393764 hartree
zpe.sumelectthermalfe: -485.438560 hartree
dipole: -0.7019 0.0005 -0.0013
dipole: 0.7019
quadrupole: -40.7895 -46.3244 -46.3255
quadrupole: -0.0008 -0.0010 -0.0003
quadrupole: 3.6903 -1.8446 -1.8457 -0.0008 -0.0010 -0.0003
hfenergy: -485.5335145 hartree
pointgroup: C01 [X(C5H10Si1)]
dipole: 0.276159 0.0002242 0.0003331 debye
dipolederiv: 1.6970977 0.000161 -0.0000522 -0.0004517 1.2839463 -0.000113 -0.0001891 -0.0002549 1.2841067 -0.3403953 0.0180715 -0.0232611 0.0147205 -0.3511672 0.0595695 -0.0196368 0.05918 -0.3832716 -0.3403385 0.0113529 0.0273465 0.009582 -0.3236936 -0.0437258 0.0227714 -0.0435958 -0.410407 -0.3403584 -0.0291022 -0.0036355 -0.0242491 -0.4265268 -0.0155905 -0.0031754 -0.015262 -0.3076666 -0.4715996 -0.000034 0.000031 0.0000525 -0.3940761 0.0000078 -0.0000049 0.0000266 -0.393923 -0.4814741 -0.0000273 -0.0000676 -0.0001231 -0.2926864 0.0000178 -0.0001785 0.000007 -0.2926423 0.0960494 0.0157637 0.0501335 0.008917 0.0931811 -0.0444633 0.0658266 -0.062884 -0.1182731 0.0964604 -0.0515385 -0.0023632 -0.0645734 -0.1316863 -0.0030561 0.0083128 0.0152915 0.1056038 -0.1613733 0.0176456 -0.0243672 0.0460114 0.1015667 0.0060446 -0.0613105 0.0059463 0.0980982 -0.1616109 0.0115298 0.0276192 0.0295649 0.1042122 -0.0044382 0.070741 -0.0044604 0.0954115 0.0963276 -0.0508346 -0.0111462 -0.0608003 -0.1127623 -0.0549585 -0.0247951 -0.0734164 0.0870589 0.0963435 0.0278 -0.0439566 0.0251644 0.0525105 0.0900209 -0.0606766 0.1084809 -0.0781004 0.0964163 0.0347355 -0.038404 0.0516411 -0.0181803 0.1278136 -0.040166 0.1094797 -0.0077089 0.096058 0.0243752 0.0463674 0.0404055 0.0402803 -0.1154323 0.0525148 -0.0968825 -0.0655113 -0.1613155 -0.0299251 -0.0043171 -0.075939 0.093727 -0.0016846 -0.0101978 -0.0016449 0.1058937 0.1837126 0.0000265 0.0000733 0.0000774 0.2813549 -0.0000119 0.0001641 -0.0000111 0.2813312 unknown
polarizability: 93.5077097|-0.0028535|66.4499105|-0.0083348|-0.0035677|66.4345196 unknown
InChI: InChI=1S/C5H10Si/c1-5-6(2,3)4/h1H,2-4H3
charge 0 multiplicity 1
16 atoms
Si 0.548084 0.00031 0.000242
C  1.143039 -1.102913 1.442989
C  1.143204 -0.698714 -1.676026
C  1.1431 1.801571 0.232707
C  -1.325341 0.000426 0.00035
C  -2.565918 0.000462 0.000678
H  0.771108 -0.720435 2.410265
H  0.777185 -2.138286 1.322681
H  2.247633 -1.129909 1.484238
H  2.247815 -0.717364 -1.720855
H  0.774742 -1.729335 -1.825546
H  0.774565 -0.08029 -2.513863
H  0.776013 2.445238 -0.586582
H  0.772209 2.218868 1.185922
H  2.247694 1.850413 0.241337
H  -3.642232 0.000756 0.001461
