program: Orca
programVersion: 5.0.2
elementType: Cl Cl Cl O O N C C C C C C C C C C C C C C H H H H H H H H H H H H H H H H
charge: 0
multiplicity: 1
keywords: wb97x-d3
keywords: def2-TZVPP
keywords: def2/J RIJCOSX
keywords: DEFGRID2
keywords: scfconv7
keywords: smallprint printgap noloewdin
keywords: NOSOSCF
formula: C14H16Cl3NO2
InChI: InChI=1/C14H16Cl3NO2/c1-4-14(3,12(19)7-15)18-13(20)9-5-10(16)8(2)11(17)6-9/h5-6,18H,4,7H2,1-3H3
36 atoms
Cl -3.960836 2.495222 -1.834713
Cl 3.50887 -0.495878 2.858789
Cl 4.051887 0.113009 -2.493734
O  -4.382218 -0.284429 -1.143748
O  -0.973483 -1.093104 -1.455411
N  -1.358287 -0.389074 0.646753
C  -2.796465 -0.612643 0.616656
C  -3.406386 0.019531 1.88888
C  -3.139352 -2.098618 0.543394
C  -3.423182 0.148076 -0.557613
C  -2.974801 -0.631951 3.19559
C  -0.547191 -0.706619 -0.37143
C  -2.835783 1.509119 -0.874016
C  0.917548 -0.529575 -0.144556
C  1.725614 -0.326034 -1.255958
C  1.495271 -0.583144 1.116108
C  3.708466 -0.179527 0.167324
C  2.863083 -0.410052 1.252891
C  3.084136 -0.151042 -1.083124
C  5.183413 0.021902 0.289892
H  -3.157237 1.083205 1.920909
H  -4.492519 -0.042949 1.801395
H  -2.612593 -2.640085 1.327104
H  -4.206598 -2.256645 0.692554
H  -2.862934 -2.541059 -0.411245
H  -0.965951 0.003198 1.489145
H  -1.895105 -0.602011 3.349468
H  -3.294468 -1.670736 3.263988
H  -3.428598 -0.096358 4.029193
H  -1.920964 1.393612 -1.45481
H  -2.585449 2.058649 0.031828
H  1.296439 -0.29129 -2.247643
H  0.904394 -0.781224 2.000282
H  5.481579 0.971454 -0.155193
H  5.516525 0.022097 1.322795
H  5.727102 -0.765178 -0.234151
elementType: Cl O N C H
totalener: -2129.08028392 hartree
nucrepener: 1943.73616942 hartree
electener: -4072.81645335 hartree
oneelecener: -6788.77935169 hartree
twoeener: 2715.96289834 hartree
cpcmener: -0.04596806 hartree
kineticenergy: 2123.77206403 hartree
xcener: -136.103777610315 hartree
chargesum: -0.0000000
charge: -0.158812 -0.077409 -0.078331 -0.398670 -0.540892 -0.209536 0.308039 -0.156827 -0.355686 0.191849 -0.275750 0.447448 -0.092065 -0.008236 -0.157414 -0.191469 -0.015379 0.088978 0.041099 -0.221897 0.110545 0.094460 0.113898 0.111088 0.115836 0.182587 0.082672 0.090871 0.102125 0.147827 0.153692 0.124918 0.123985 0.108020 0.085593 0.112841
qa: -0.1588 -0.0774 -0.0783 -0.3987 -0.5409 -0.2095 0.3080 -0.1568 -0.3557 0.1918 -0.2757 0.4474 -0.0921 -0.0082 -0.1574 -0.1915 -0.0154 0.0890 0.0411 -0.2219 0.1105 0.0945 0.1139 0.1111 0.1158 0.1826 0.0827 0.0909 0.1021 0.1478 0.1537 0.1249 0.1240 0.1080 0.0856 0.1128
va: 1.1207 1.2460 1.2478 2.0793 1.9556 3.2916 3.6516 3.8561 3.9567 3.9798 3.9545 4.0359 3.9969 3.6929 4.0991 4.1093 3.7176 3.8422 3.9246 3.9270 1.0033 1.0150 0.9981 1.0076 1.0159 1.0070 1.0037 0.9979 1.0031 1.0177 1.0062 1.0430 1.0315 0.9995 1.0236 0.9974
dispcorr: -0.019405973 hartree
energy: -2129.099689896643
dipole: -16.92289 18.63861 1.71572 -8.19975 8.80598 0.60623 17.96670 -14.45350 3.51320
magnitude: 3.95649 au
magnitude: 10.05660 debye
