program: Orca
programVersion: 5.0.2
elementType: Cl Cl Cl O O N C C C C C C C C C C C C C C H H H H H H H H H H H H H H H H
charge: 0
multiplicity: 1
keywords: wb97x-d3
keywords: def2-TZVPP
keywords: def2/J RIJCOSX
keywords: DEFGRID2
keywords: scfconv7
keywords: smallprint printgap noloewdin
keywords: NOSOSCF
formula: C14H16Cl3NO2
InChI: InChI=1/C14H16Cl3NO2/c1-4-14(3,12(19)7-15)18-13(20)9-5-10(16)8(2)11(17)6-9/h5-6,18H,4,7H2,1-3H3
36 atoms
Cl -4.049781 2.73118 -1.16709
Cl 3.52171 -1.433956 2.610646
Cl 4.049408 0.862782 -2.263318
O  -4.581647 -0.104859 -0.874243
O  -0.951281 -0.833686 -1.671151
N  -1.344994 -0.568392 0.535606
C  -2.778227 -0.818239 0.502866
C  -3.328172 -0.599981 1.932682
C  -3.083071 -2.260484 0.095202
C  -3.502553 0.170608 -0.413629
C  -3.215006 0.797887 2.524381
C  -0.535931 -0.67335 -0.527773
C  -2.854908 1.518159 -0.653098
C  0.927207 -0.543973 -0.255266
C  1.730804 0.007754 -1.244667
C  1.505082 -0.980152 0.928418
C  3.712735 -0.274714 0.160491
C  2.871581 -0.846204 1.115234
C  3.08643 0.142284 -1.017785
C  5.185316 -0.104313 0.343967
H  -4.375054 -0.905839 1.926272
H  -2.804413 -1.312824 2.575625
H  -2.543088 -2.93986 0.754074
H  -4.144677 -2.475674 0.199085
H  -2.794221 -2.477724 -0.930699
H  -0.935469 -0.379132 1.438355
H  -3.534887 0.770282 3.565661
H  -3.853881 1.521525 2.016796
H  -2.194049 1.182605 2.51656
H  -2.114632 1.426676 -1.448002
H  -2.345717 1.893344 0.231126
H  1.300061 0.346055 -2.177041
H  0.912732 -1.447727 1.703835
H  5.467899 0.944139 0.244841
H  5.523547 -0.446723 1.316717
H  5.737271 -0.660284 -0.414733
elementType: Cl O N C H
totalener: -2129.07932746 hartree
nucrepener: 1947.79164709 hartree
electener: -4076.87097455 hartree
oneelecener: -6796.79600060 hartree
twoeener: 2719.92502606 hartree
cpcmener: -0.04340086 hartree
kineticenergy: 2123.76740854 hartree
xcener: -136.101852400108 hartree
chargesum: -0.0000000
charge: -0.158446 -0.078404 -0.078784 -0.403367 -0.543189 -0.201359 0.278895 -0.131696 -0.322418 0.175008 -0.289147 0.459187 -0.106781 -0.010312 -0.164714 -0.190157 -0.009101 0.081020 0.036952 -0.220420 0.093472 0.103832 0.111803 0.103343 0.114617 0.184406 0.107442 0.086884 0.089671 0.162833 0.163266 0.126367 0.122649 0.108608 0.085584 0.112454
qa: -0.1584 -0.0784 -0.0788 -0.4034 -0.5432 -0.2014 0.2789 -0.1317 -0.3224 0.1750 -0.2891 0.4592 -0.1068 -0.0103 -0.1647 -0.1902 -0.0091 0.0810 0.0370 -0.2204 0.0935 0.1038 0.1118 0.1033 0.1146 0.1844 0.1074 0.0869 0.0897 0.1628 0.1633 0.1264 0.1226 0.1086 0.0856 0.1125
va: 1.1202 1.2442 1.2472 2.0764 1.9498 3.2444 3.6824 3.8370 3.9254 3.9958 3.9564 4.0267 3.9633 3.6821 4.0962 4.1053 3.7134 3.8509 3.9242 3.9251 1.0141 1.0053 1.0059 1.0160 1.0151 1.0007 1.0042 1.0029 1.0022 1.0201 0.9988 1.0401 1.0348 0.9994 1.0237 0.9978
dispcorr: -0.019757958 hartree
energy: -2129.099085415136
dipole: -16.77275 18.65782 1.88507 -7.40615 7.19930 -0.20685 13.96851 -10.74560 3.22291
magnitude: 3.73944 au
magnitude: 9.50491 debye
