program: Orca
programVersion: 5.0.2
elementType: Cl Cl Cl O O N C C C C C C C C C C C C C C H H H H H H H H H H H H H H H H
charge: 0
multiplicity: 1
keywords: wb97x-d3
keywords: def2-TZVPP
keywords: def2/J RIJCOSX
keywords: DEFGRID2
keywords: scfconv7
keywords: smallprint printgap noloewdin
keywords: NOSOSCF
formula: C14H16Cl3NO2
InChI: InChI=1/C14H16Cl3NO2/c1-4-14(3,12(19)7-15)18-13(20)9-5-10(16)8(2)11(17)6-9/h5-6,18H,4,7H2,1-3H3
36 atoms
Cl -4.919467 -1.68674 -1.7552
Cl 4.012145 -1.901192 -1.755709
Cl 3.881161 2.152673 1.830186
O  -2.800643 0.268627 -1.551364
O  -0.908055 -1.456718 0.119785
N  -1.15116 0.715473 0.644385
C  -2.596646 0.64067 0.798887
C  -3.1212 2.091604 0.775174
C  -2.949188 -0.039707 2.120601
C  -3.166632 -0.057311 -0.451054
C  -4.634375 2.241465 0.761089
C  -0.410448 -0.355739 0.341803
C  -4.235682 -1.094823 -0.227329
C  1.066121 -0.155441 0.253375
C  1.737074 0.812331 0.986722
C  1.787319 -1.000404 -0.580624
C  3.873406 0.121405 0.025827
C  3.15483 -0.842838 -0.686925
C  3.112549 0.932721 0.867696
C  5.354517 0.239131 -0.129628
H  -2.712866 2.597051 1.654427
H  -2.702268 2.594197 -0.099932
H  -2.570963 -1.059244 2.176234
H  -2.507167 0.527799 2.939218
H  -4.023988 -0.073267 2.293461
H  -0.718756 1.623137 0.733471
H  -5.108228 1.77957 1.626826
H  -5.086859 1.819143 -0.137618
H  -4.893397 3.299659 0.777729
H  -5.046039 -0.688258 0.377127
H  -3.815761 -1.941249 0.316188
H  1.212634 1.463442 1.672999
H  1.28348 -1.766778 -1.153335
H  5.619469 0.437026 -1.168793
H  5.77216 1.037611 0.475252
H  5.849058 -0.689263 0.158226
elementType: Cl O N C H
totalener: -2129.08073203 hartree
nucrepener: 1933.34493913 hartree
electener: -4062.42567116 hartree
oneelecener: -6769.31360085 hartree
twoeener: 2706.88792969 hartree
cpcmener: -0.04450675 hartree
kineticenergy: 2123.77568802 hartree
xcener: -136.104565271465 hartree
chargesum: -0.0000000
charge: -0.157456 -0.078995 -0.079163 -0.402782 -0.557621 -0.172965 0.266645 -0.120614 -0.341605 0.151910 -0.294398 0.488110 -0.073708 -0.024769 -0.183663 -0.157470 -0.007712 0.033627 0.079913 -0.220981 0.103675 0.098092 0.117792 0.107564 0.106472 0.174620 0.093626 0.086809 0.103981 0.155403 0.153258 0.120919 0.125487 0.109160 0.085955 0.110883
qa: -0.1575 -0.0790 -0.0792 -0.4028 -0.5576 -0.1730 0.2666 -0.1206 -0.3416 0.1519 -0.2944 0.4881 -0.0737 -0.0248 -0.1837 -0.1575 -0.0077 0.0336 0.0799 -0.2210 0.1037 0.0981 0.1178 0.1076 0.1065 0.1746 0.0936 0.0868 0.1040 0.1554 0.1533 0.1209 0.1255 0.1092 0.0860 0.1109
va: 1.1236 1.2472 1.2432 2.0712 1.9409 3.2895 3.8053 3.8528 3.9565 3.9756 3.9635 4.0126 3.9768 3.7017 4.1048 4.0934 3.7128 3.9300 3.8541 3.9263 1.0049 1.0205 1.0098 1.0076 1.0032 1.0076 0.9981 1.0007 1.0035 1.0021 1.0083 1.0361 1.0429 0.9990 1.0237 0.9983
dispcorr: -0.019154093 hartree
energy: -2129.099886126184
dipole: -22.23478 22.14595 -0.08883 12.40480 -10.23456 2.17024 14.17679 -11.39298 2.78382
magnitude: 3.53093 au
magnitude: 8.97490 debye
