program: Orca
programVersion: 5.0.2
elementType: Cl Cl Cl O O N C C C C C C C C C C C C C C H H H H H H H H H H H H H H H H
charge: 0
multiplicity: 1
keywords: wb97x-d3
keywords: def2-TZVPP
keywords: def2/J RIJCOSX
keywords: DEFGRID2
keywords: scfconv7
keywords: smallprint printgap noloewdin
keywords: NOSOSCF
formula: C14H16Cl3NO2
InChI: InChI=1/C14H16Cl3NO2/c1-4-14(3,12(19)7-15)18-13(20)9-5-10(16)8(2)11(17)6-9/h5-6,18H,4,7H2,1-3H3
36 atoms
Cl -5.445227 -1.459022 -1.982434
Cl 3.304672 -2.408356 -1.10713
Cl 4.528383 2.403738 1.056036
O  -2.627423 -1.169385 -1.405194
O  -0.494046 1.267974 2.175858
N  -1.215754 0.018969 0.419576
C  -2.65321 0.122407 0.616857
C  -3.139333 1.583268 0.475195
C  -3.081953 -0.463188 1.965791
C  -3.285127 -0.699699 -0.510376
C  -2.881561 2.205033 -0.887348
C  -0.272048 0.586455 1.180202
C  -4.780843 -0.892735 -0.438006
C  1.141232 0.356339 0.739596
C  2.08177 1.32976 1.05147
C  1.546792 -0.790369 0.072637
C  3.848476 0.022558 -0.020966
C  2.876101 -0.940672 -0.290226
C  3.39537 1.153999 0.663845
C  5.28331 -0.108395 -0.41665
H  -4.205618 1.619582 0.704562
H  -2.653243 2.171393 1.252847
H  -2.794158 -1.510946 2.052783
H  -2.623762 0.087479 2.783443
H  -4.160978 -0.39116 2.097093
H  -0.930985 -0.428269 -0.441161
H  -3.451483 1.71926 -1.681727
H  -1.826445 2.167084 -1.160256
H  -3.177268 3.253796 -0.879348
H  -5.296286 0.022183 -0.153166
H  -5.002485 -1.642019 0.323809
H  1.789007 2.225649 1.581306
H  0.849021 -1.58621 -0.150582
H  5.479311 -1.025094 -0.963821
H  5.587534 0.726332 -1.04881
H  5.930898 -0.101101 0.460887
elementType: Cl O N C H
totalener: -2129.07933843 hartree
nucrepener: 1924.13021007 hartree
electener: -4053.20954850 hartree
oneelecener: -6750.16314834 hartree
twoeener: 2696.95359984 hartree
cpcmener: -0.03561505 hartree
kineticenergy: 2123.77303719 hartree
xcener: -136.105346038864 hartree
chargesum: 0.0000000
charge: -0.152780 -0.080014 -0.080256 -0.398455 -0.557133 -0.204395 0.261868 -0.178788 -0.338292 0.235051 -0.272387 0.470834 -0.101394 0.000328 -0.163112 -0.188101 -0.013899 0.083571 0.037851 -0.221230 0.096855 0.098954 0.121615 0.112343 0.110217 0.178492 0.083563 0.090281 0.100574 0.155120 0.162716 0.124158 0.120080 0.085632 0.108920 0.111212
qa: -0.1528 -0.0800 -0.0803 -0.3985 -0.5571 -0.2044 0.2619 -0.1788 -0.3383 0.2351 -0.2724 0.4708 -0.1014 0.0003 -0.1631 -0.1881 -0.0139 0.0836 0.0379 -0.2212 0.0969 0.0990 0.1216 0.1123 0.1102 0.1785 0.0836 0.0903 0.1006 0.1551 0.1627 0.1242 0.1201 0.0856 0.1089 0.1112
va: 1.1224 1.2428 1.2460 2.0677 1.9388 3.2491 3.8627 3.8533 3.9413 3.9407 3.9511 4.0008 4.0328 3.7026 4.1022 4.1031 3.7125 3.8461 3.9281 3.9253 1.0079 1.0270 1.0017 1.0212 1.0014 1.0342 1.0050 1.0076 1.0031 1.0063 0.9952 1.0434 1.0405 1.0238 0.9991 0.9981
dispcorr: -0.019166738 hartree
energy: -2129.098505168690
dipole: -18.79146 17.69779 -1.09368 8.85711 -8.96937 -0.11226 7.17981 -6.91507 0.26474
magnitude: 1.13085 au
magnitude: 2.87439 debye
