program: Orca
programVersion: 5.0.2
elementType: Cl Cl Cl O O N C C C C C C C C C C C C C C H H H H H H H H H H H H H H H H
charge: 0
multiplicity: 1
keywords: wb97x-d3
keywords: def2-TZVPP
keywords: def2/J RIJCOSX
keywords: DEFGRID2
keywords: scfconv7
keywords: smallprint printgap noloewdin
keywords: NOSOSCF
formula: C14H16Cl3NO2
InChI: InChI=1/C14H16Cl3NO2/c1-4-14(3,12(19)7-15)18-13(20)9-5-10(16)8(2)11(17)6-9/h5-6,18H,4,7H2,1-3H3
36 atoms
Cl -4.289678 2.185764 1.656637
Cl 3.543072 -1.512734 2.26918
Cl 4.200184 0.805697 -2.579531
O  -4.096209 0.917337 -1.159952
O  -0.917402 0.89825 -1.412367
N  -1.287467 -0.686395 0.128239
C  -2.723175 -0.739224 -0.11156
C  -3.366586 -1.292939 1.179781
C  -3.018956 -1.629569 -1.312568
C  -3.26633 0.673901 -0.3185
C  -4.870749 -1.500873 1.125473
C  -0.475312 0.081337 -0.606912
C  -2.853782 1.74892 0.675324
C  0.994063 -0.084382 -0.414417
C  1.831538 0.379127 -1.421099
C  1.549579 -0.664933 0.717142
C  3.801388 -0.361091 -0.17796
C  2.925383 -0.790843 0.819535
C  3.197598 0.228655 -1.291833
C  5.286375 -0.496345 -0.096365
H  -2.881979 -2.250853 1.389556
H  -3.114158 -0.636958 2.016798
H  -2.651801 -2.636652 -1.113435
H  -4.084537 -1.700824 -1.520702
H  -2.52666 -1.260944 -2.212001
H  -0.905543 -1.424827 0.701085
H  -5.219417 -1.860039 2.093489
H  -5.156574 -2.244566 0.382743
H  -5.41743 -0.582485 0.910163
H  -2.53438 2.64251 0.142595
H  -2.071411 1.438915 1.361622
H  1.420343 0.843339 -2.306519
H  0.936091 -1.003682 1.540939
H  5.672431 -1.047913 -0.95393
H  5.7639 0.484422 -0.102673
H  5.606977 -1.014575 0.801657
elementType: Cl O N C H
totalener: -2129.07870229 hartree
nucrepener: 1947.80784448 hartree
electener: -4076.88654677 hartree
oneelecener: -6797.27391742 hartree
twoeener: 2720.38737065 hartree
cpcmener: -0.04179491 hartree
kineticenergy: 2123.77990610 hartree
xcener: -136.105164505652 hartree
chargesum: 0.0000000
charge: -0.154242 -0.077631 -0.077607 -0.407197 -0.541525 -0.187732 0.361143 -0.187800 -0.348015 0.181260 -0.276498 0.474943 -0.103558 -0.041044 -0.148435 -0.189414 -0.014581 0.089290 0.038348 -0.222090 0.099966 0.108118 0.115906 0.100624 0.114865 0.173820 0.103024 0.092579 0.077887 0.154717 0.139992 0.126271 0.117481 0.107992 0.113079 0.086064
qa: -0.1542 -0.0776 -0.0776 -0.4072 -0.5415 -0.1877 0.3611 -0.1878 -0.3480 0.1813 -0.2765 0.4749 -0.1036 -0.0410 -0.1484 -0.1894 -0.0146 0.0893 0.0383 -0.2221 0.1000 0.1081 0.1159 0.1006 0.1149 0.1738 0.1030 0.0926 0.0779 0.1547 0.1400 0.1263 0.1175 0.1080 0.1131 0.0861
va: 1.1223 1.2449 1.2486 2.0697 1.9587 3.2741 3.5382 3.9043 3.9844 4.0246 3.9391 4.0257 3.9663 3.7355 4.0809 4.1195 3.7222 3.8513 3.9254 3.9275 1.0085 1.0053 1.0019 1.0073 1.0100 1.0099 1.0030 0.9999 1.0156 1.0088 1.0194 1.0443 1.0359 0.9997 0.9972 1.0236
dispcorr: -0.019861652 hartree
energy: -2129.098563944073
dipole: -20.65643 22.46216 1.80573 -13.65809 11.26230 -2.39579 1.20125 0.73519 1.93644
magnitude: 3.57075 au
magnitude: 9.07613 debye
