program: Orca
programVersion: 5.0.2
elementType: Cl Cl Cl O O N C C C C C C C C C C C C C C H H H H H H H H H H H H H H H H
charge: 0
multiplicity: 1
keywords: wb97x-d3
keywords: def2-TZVPP
keywords: def2/J RIJCOSX
keywords: DEFGRID2
keywords: scfconv7
keywords: smallprint printgap noloewdin
keywords: NOSOSCF
formula: C14H16Cl3NO2
InChI: InChI=1/C14H16Cl3NO2/c1-4-14(3,12(19)7-15)18-13(20)9-5-10(16)8(2)11(17)6-9/h5-6,18H,4,7H2,1-3H3
36 atoms
Cl -4.277358 2.194192 1.668466
Cl 3.540539 -1.506227 2.275525
Cl 4.200954 0.800194 -2.581142
O  -4.108502 0.913411 -1.151188
O  -0.914918 0.905677 -1.406818
N  -1.28961 -0.680754 0.131716
C  -2.725109 -0.737182 -0.110562
C  -3.366764 -1.296211 1.179697
C  -3.017332 -1.624843 -1.314674
C  -3.273978 0.675351 -0.316627
C  -4.870363 -1.50926 1.127386
C  -0.475985 0.086495 -0.607512
C  -2.853053 1.754149 0.671051
C  0.994027 -0.083285 -0.414156
C  1.831897 0.377541 -1.421487
C  1.549111 -0.66015 0.719325
C  3.801103 -0.36292 -0.176929
C  2.924838 -0.788522 0.822316
C  3.197925 0.225903 -1.292101
C  5.28618 -0.500523 -0.095658
H  -2.88071 -2.254033 1.389586
H  -3.115243 -0.641061 2.018013
H  -2.645927 -2.63223 -1.121752
H  -4.082272 -1.699045 -1.524403
H  -2.52757 -1.250373 -2.213304
H  -0.904645 -1.433358 0.683216
H  -5.218832 -1.862535 2.097856
H  -5.154427 -2.259883 0.39071
H  -5.420922 -0.595292 0.904944
H  -2.540294 2.646347 0.131779
H  -2.062222 1.447833 1.349904
H  1.418873 0.841379 -2.306485
H  0.93421 -0.992636 1.54489
H  5.672397 -1.051629 -0.953794
H  5.766694 0.479144 -0.099486
H  5.60668 -1.021138 0.801329
elementType: Cl O N C H
totalener: -2129.08819399 hartree
nucrepener: 1947.20252038 hartree
electener: -4076.29071437 hartree
oneelecener: -6796.06311013 hartree
twoeener: 2719.77239576 hartree
cpcmener: -0.03321173 hartree
kineticenergy: 2123.77729562 hartree
xcener: -136.101952015533 hartree
chargesum: -0.0000000
charge: -0.153050 -0.076829 -0.075300 -0.377609 -0.505875 -0.194718 0.360499 -0.190687 -0.346533 0.168923 -0.274072 0.451134 -0.106603 -0.036245 -0.148984 -0.194198 -0.017636 0.088373 0.040609 -0.222838 0.096186 0.106394 0.112396 0.101195 0.115079 0.167485 0.101375 0.091091 0.080744 0.153625 0.135722 0.127765 0.115773 0.107567 0.112988 0.086253
qa: -0.1531 -0.0768 -0.0753 -0.3776 -0.5059 -0.1947 0.3605 -0.1907 -0.3465 0.1689 -0.2741 0.4511 -0.1066 -0.0362 -0.1490 -0.1942 -0.0176 0.0884 0.0406 -0.2228 0.0962 0.1064 0.1124 0.1012 0.1151 0.1675 0.1014 0.0911 0.0807 0.1536 0.1357 0.1278 0.1158 0.1076 0.1130 0.0863
va: 1.1235 1.2456 1.2509 2.1053 2.0009 3.2507 3.5337 3.9091 3.9861 4.0472 3.9411 4.0560 3.9652 3.7252 4.0833 4.1172 3.7236 3.8591 3.9237 3.9287 1.0085 1.0055 1.0019 1.0080 1.0104 1.0134 1.0031 1.0003 1.0155 1.0088 1.0199 1.0434 1.0371 0.9999 0.9973 1.0235
dispcorr: -0.019862747 hartree
energy: -2129.108056736919
dipole: -20.66454 22.37290 1.70836 -13.70908 11.46173 -2.24735 1.11461 0.59642 1.71103
magnitude: 3.30102 au
magnitude: 8.39052 debye
