program: Orca
programVersion: 5.0.2
elementType: Cl Cl Cl O O N C C C C C C C C C C C C C C H H H H H H H H H H H H H H H H
charge: 0
multiplicity: 1
keywords: wb97x-d3
keywords: def2-TZVPP
keywords: def2/J RIJCOSX
keywords: DEFGRID2
keywords: scfconv7
keywords: smallprint printgap noloewdin
keywords: NOSOSCF
formula: C14H16Cl3NO2
InChI: InChI=1/C14H16Cl3NO2/c1-4-14(3,12(19)7-15)18-13(20)9-5-10(16)8(2)11(17)6-9/h5-6,18H,4,7H2,1-3H3
36 atoms
Cl -2.310687 -0.825657 -2.504745
Cl 4.107246 1.89795 1.526064
Cl 2.901465 -2.46189 -1.450938
O  -4.647686 1.299483 -0.371909
O  -1.115393 1.868996 0.423238
N  -1.622319 -0.327046 0.478518
C  -3.054575 -0.155694 0.635379
C  -3.407084 0.522119 1.976897
C  -3.708434 -1.541971 0.564145
C  -3.635805 0.670939 -0.521225
C  -2.768694 -0.137416 3.190043
C  -0.758808 0.7064 0.398711
C  -2.970285 0.718929 -1.892043
C  0.683254 0.335157 0.274049
C  1.102679 -0.779457 -0.43553
C  1.625679 1.170096 0.856973
C  3.433852 -0.270799 0.067409
C  2.965551 0.850915 0.758975
C  2.456178 -1.064012 -0.53232
C  4.899368 -0.559659 -0.011848
H  -3.111074 1.569741 1.94009
H  -4.492237 0.515944 2.084005
H  -3.344045 -2.177941 1.372075
H  -4.78676 -1.449838 0.680253
H  -3.509873 -2.046314 -0.379855
H  -1.255767 -1.261938 0.528472
H  -3.070088 0.390562 4.094197
H  -1.679998 -0.107048 3.151216
H  -3.070744 -1.177506 3.317108
H  -2.157731 1.444699 -1.870026
H  -3.713705 1.058896 -2.609431
H  0.393754 -1.405819 -0.961192
H  1.310646 2.059387 1.384686
H  5.328576 -0.65523 0.985628
H  5.107202 -1.474647 -0.556844
H  5.426292 0.255641 -0.508701
totalener: -2129.06070305 hartree
nucrepener: 1996.79555638 hartree
electener: -4125.85625944 hartree
oneelecener: -6895.55764238 hartree
twoeener: 2769.70138294 hartree
kineticenergy: 2123.84051614 hartree
xcener: -136.106579520284 hartree
chargesum: -0.0000000
charge: -0.141892 -0.059688 -0.063847 -0.293725 -0.396948 -0.205243 0.207292 -0.116480 -0.327646 0.152101 -0.281396 0.305430 -0.046589 0.053219 -0.202905 -0.171452 -0.040429 0.057018 0.059695 -0.221685 0.106802 0.086813 0.101174 0.112218 0.121636 0.150831 0.096818 0.079933 0.074601 0.129075 0.144200 0.107178 0.127726 0.103016 0.086548 0.106601
qa: -0.1419 -0.0597 -0.0638 -0.2937 -0.3969 -0.2052 0.2073 -0.1165 -0.3276 0.1521 -0.2814 0.3054 -0.0466 0.0532 -0.2029 -0.1715 -0.0404 0.0570 0.0597 -0.2217 0.1068 0.0868 0.1012 0.1122 0.1216 0.1508 0.0968 0.0799 0.0746 0.1291 0.1442 0.1072 0.1277 0.1030 0.0865 0.1066
va: 1.1470 1.2678 1.2605 2.1809 2.1029 3.0849 3.8007 3.8316 3.9178 4.0461 3.9594 4.1410 3.9349 3.6031 4.0815 4.1243 3.7362 3.9136 3.9710 3.9369 1.0240 1.0234 1.0004 1.0114 1.0252 1.0221 1.0079 1.0060 1.0002 1.0180 1.0129 1.0549 1.0373 1.0014 1.0262 0.9996
dispcorr: -0.020913292 hartree
energy: -2129.081616346753
dipole: -21.90571 22.36945 0.46373 -2.20800 0.99133 -1.21667 15.19440 -14.84352 0.35088
magnitude: 1.34850 au
magnitude: 3.42761 debye
