program: Orca
programVersion: 5.0.2
elementType: Cl Cl Cl O O N C C C C C C C C C C C C C C H H H H H H H H H H H H H H H H
charge: 0
multiplicity: 1
keywords: wb97x-d3
keywords: def2-TZVPP
keywords: def2/J RIJCOSX
keywords: DEFGRID2
keywords: scfconv7
keywords: smallprint printgap noloewdin
keywords: NOSOSCF
formula: C14H16Cl3NO2
InChI: InChI=1/C14H16Cl3NO2/c1-4-14(3,12(19)7-15)18-13(20)9-5-10(16)8(2)11(17)6-9/h5-6,18H,4,7H2,1-3H3
36 atoms
Cl -5.393983 1.990583 0.16488
Cl 4.431367 -1.587987 2.084812
Cl 3.390725 1.623714 -2.14743
O  -2.548253 1.689985 -1.243767
O  -0.59412 -2.269377 0.681548
N  -1.219077 -0.310753 -0.279264
C  -2.652835 -0.50245 -0.278209
C  -3.221739 -0.691291 1.145955
C  -3.040076 -1.689625 -1.174549
C  -3.237404 0.770569 -0.888579
C  -2.756345 0.345417 2.156287
C  -0.312841 -1.194253 0.189947
C  -4.747599 0.859364 -1.050492
C  1.114262 -0.74611 0.080547
C  1.553082 0.155226 -0.880109
C  2.029917 -1.283427 0.97185
C  3.833836 0.026483 -0.016864
C  3.355707 -0.8900 0.922006
C  2.887171 0.516854 -0.917694
C  5.259633 0.472908 -0.091334
H  -4.31366 -0.689321 1.092643
H  -2.940093 -1.688566 1.483952
H  -2.719228 -1.530674 -2.204582
H  -2.562495 -2.593838 -0.804498
H  -4.115233 -1.867179 -1.171257
H  -0.912788 0.614085 -0.540412
H  -3.021584 1.36232 1.866412
H  -1.678311 0.307914 2.306156
H  -3.22289 0.155229 3.12225
H  -5.257578 -0.091058 -0.923824
H  -4.977383 1.259525 -2.036782
H  0.883287 0.55975 -1.627364
H  1.703214 -2.006841 1.705499
H  5.864969 0.039395 0.697982
H  5.702837 0.193549 -1.047773
H  5.328673 1.558012 -0.012639
totalener: -2129.06285720 hartree
nucrepener: 1937.98207711 hartree
electener: -4067.04493431 hartree
oneelecener: -6777.99194989 hartree
twoeener: 2710.94701558 hartree
kineticenergy: 2123.83451071 hartree
xcener: -136.108564231337 hartree
chargesum: 0.0000000
charge: -0.103016 -0.065944 -0.063671 -0.308040 -0.416014 -0.231538 0.257856 -0.201999 -0.333989 0.184449 -0.255643 0.375184 -0.116469 0.011789 -0.201640 -0.162285 -0.040919 0.095684 0.049403 -0.221754 0.087226 0.111692 0.111971 0.129220 0.092259 0.159838 0.082428 0.088335 0.093412 0.116171 0.144018 0.110857 0.125996 0.087257 0.105172 0.102707
qa: -0.1030 -0.0659 -0.0637 -0.3080 -0.4160 -0.2315 0.2579 -0.2020 -0.3340 0.1844 -0.2556 0.3752 -0.1165 0.0118 -0.2016 -0.1623 -0.0409 0.0957 0.0494 -0.2218 0.0872 0.1117 0.1120 0.1292 0.0923 0.1598 0.0824 0.0883 0.0934 0.1162 0.1440 0.1109 0.1260 0.0873 0.1052 0.1027
va: 1.1636 1.2562 1.2658 2.1503 2.0867 3.1646 3.8249 3.8473 3.9185 3.9551 3.9566 4.0923 4.0333 3.6969 4.0867 4.1255 3.7366 3.8542 3.9662 3.9338 1.0067 1.0245 1.0059 1.0200 1.0057 1.0543 1.0146 1.0074 1.0068 1.0117 1.0034 1.0457 1.0407 1.0274 0.9998 1.0010
dispcorr: -0.019787521 hartree
energy: -2129.082644721737
dipole: -18.64945 17.96711 -0.68235 -7.12063 7.09645 -0.02418 1.81540 -2.34086 -0.52546
magnitude: 0.86156 au
magnitude: 2.18992 debye
