program: Orca
programVersion: 5.0.2
elementType: Cl Cl Cl O O N C C C C C C C C C C C C C C H H H H H H H H H H H H H H H H
charge: 0
multiplicity: 1
keywords: wb97x-d3
keywords: def2-TZVPP
keywords: def2/J RIJCOSX
keywords: DEFGRID2
keywords: scfconv7
keywords: smallprint printgap noloewdin
keywords: NOSOSCF
formula: C14H16Cl3NO2
InChI: InChI=1/C14H16Cl3NO2/c1-4-14(3,12(19)7-15)18-13(20)9-5-10(16)8(2)11(17)6-9/h5-6,18H,4,7H2,1-3H3
36 atoms
Cl -2.292651 0.291955 -2.500203
Cl 3.638164 -2.746962 -0.767203
Cl 3.424605 2.44155 0.766926
O  -4.799129 -0.868994 0.092568
O  -1.245669 -1.677987 0.989721
N  -1.544679 0.513359 0.520234
C  -2.983788 0.536945 0.719125
C  -3.502106 1.942229 0.337039
C  -3.339707 0.226872 2.176154
C  -3.708231 -0.46139 -0.200137
C  -2.976386 3.078256 1.206073
C  -0.785704 -0.592568 0.691241
C  -3.086575 -0.959157 -1.499011
C  0.679648 -0.406706 0.460442
C  1.326396 0.799911 0.680311
C  1.413823 -1.504196 0.034011
C  3.456935 -0.165385 -0.004056
C  2.766782 -1.365199 -0.202562
C  2.689625 0.905737 0.452395
C  4.926479 -0.079207 -0.268246
H  -3.266046 2.144858 -0.710221
H  -4.59125 1.917837 0.402733
H  -2.754885 0.860504 2.840953
H  -4.395175 0.416732 2.361057
H  -3.134061 -0.80916 2.43131
H  -1.137729 1.28174 0.01344
H  -3.303445 2.989014 2.240661
H  -3.348728 4.030504 0.829709
H  -1.887158 3.139875 1.209387
H  -3.877223 -1.402329 -2.099779
H  -2.348202 -1.728013 -1.275595
H  0.792324 1.658367 1.065245
H  0.926223 -2.457343 -0.114521
H  5.148001 -0.34141 -1.302987
H  5.318408 0.915233 -0.081593
H  5.472598 -0.781455 0.3623
totalener: -2129.06054076 hartree
nucrepener: 1989.43784598 hartree
electener: -4118.49838674 hartree
oneelecener: -6880.73632689 hartree
twoeener: 2762.23794016 hartree
kineticenergy: 2123.83150064 hartree
xcener: -136.104151894020 hartree
chargesum: -0.0000000
charge: -0.139540 -0.059352 -0.065601 -0.293678 -0.403287 -0.237549 0.260978 -0.174140 -0.338180 0.146212 -0.256296 0.351956 -0.074762 0.027245 -0.215915 -0.160975 -0.039828 0.052319 0.090238 -0.221499 0.097805 0.093430 0.094515 0.112306 0.131412 0.148628 0.088607 0.099085 0.067785 0.142749 0.132097 0.118301 0.127620 0.104162 0.087091 0.106062
qa: -0.1395 -0.0594 -0.0656 -0.2937 -0.4033 -0.2375 0.2610 -0.1741 -0.3382 0.1462 -0.2563 0.3520 -0.0748 0.0272 -0.2159 -0.1610 -0.0398 0.0523 0.0902 -0.2215 0.0978 0.0934 0.0945 0.1123 0.1314 0.1486 0.0886 0.0991 0.0678 0.1427 0.1321 0.1183 0.1276 0.1042 0.0871 0.1061
va: 1.1504 1.2685 1.2588 2.1814 2.1023 3.1440 3.6977 3.8312 3.9547 4.0344 3.9538 4.1185 3.9432 3.6508 4.0973 4.1189 3.7370 3.9293 3.8950 3.9355 1.0308 1.0205 1.0013 1.0114 1.0175 1.0378 0.9989 1.0073 1.0071 1.0154 1.0156 1.0358 1.0380 1.0010 1.0255 1.0001
dispcorr: -0.020545375 hartree
energy: -2129.081086133248
dipole: -21.76705 22.35244 0.58539 11.04102 -9.84467 1.19636 11.06697 -11.22678 -0.15981
magnitude: 1.34145 au
magnitude: 3.40969 debye
