program: Orca
programVersion: 5.0.2
elementType: S S O O O O N N N N C C C C C C C C C C C C C C H H H H H H H H H H H H H H H H H H
charge: 0
multiplicity: 1
keywords: wb97x-d3
keywords: def2-TZVPP
keywords: def2/J RIJCOSX
keywords: DEFGRID2
keywords: scfconv7
keywords: smallprint printgap noloewdin
keywords: NOSOSCF
formula: C14H18N4O4S2
InChI: InChI=1/C14H18N4O4S2/c1-3-21-13(19)17-11(23)15-9-7-5-6-8-10(9)16-12(24)18-14(20)22-4-2/h5-8,15-18H,3-4H2,1-2H3
42 atoms
S  3.399355 -1.929266 -0.179878
S  0.260949 -0.746792 2.351338
O  2.239072 2.625771 -0.77197
O  -2.616905 2.763249 0.963886
O  0.385524 1.381814 -1.041486
O  -2.972363 0.969951 -0.345383
N  0.911022 -1.260094 -0.914257
N  -1.504805 -1.16774 0.41609
N  2.457512 0.435977 -0.750595
N  -1.592027 0.883433 1.483093
C  0.286288 -2.476065 -0.598918
C  -0.93932 -2.419134 0.075011
C  0.797518 -3.709227 -0.979749
C  -1.642426 -3.582388 0.34354
C  0.097116 -4.870819 -0.688226
C  -1.123563 -4.811986 -0.032995
C  2.170373 -0.910769 -0.628587
C  -1.000379 -0.35444 1.348259
C  1.58213 1.488413 -0.865194
C  -2.444689 1.50654 0.604489
C  1.485477 3.856155 -0.788477
C  -3.392593 3.613983 0.09557
C  0.912948 4.176913 0.571081
C  -2.567037 4.127309 -1.06007
H  1.731384 -3.760052 -1.518691
H  -2.592645 -3.521058 0.857469
H  0.279098 -0.486866 -1.108488
H  -2.313592 -0.854146 -0.111147
H  0.504015 -5.825867 -0.992266
H  -1.672364 -5.718168 0.184511
H  3.428545 0.666343 -0.583683
H  -1.181944 1.458943 2.207437
H  0.711487 3.811239 -1.555291
H  2.211694 4.607982 -1.089475
H  -3.712747 4.431877 0.737334
H  -4.284058 3.087188 -0.244973
H  1.694588 4.22284 1.329259
H  0.432279 5.154446 0.529272
H  0.163615 3.452661 0.887843
H  -2.216862 3.324636 -1.708887
H  -3.18384 4.794605 -1.66251
H  -1.70551 4.696043 -0.711015
elementType: S O N C H
totalener: -1860.85599214 hartree
nucrepener: 2545.36754329 hartree
electener: -4406.22353543 hartree
oneelecener: -7615.92659660 hartree
twoeener: 3209.70306117 hartree
cpcmener: -0.04557096 hartree
kineticenergy: 1855.09499926 hartree
xcener: -138.428327599211 hartree
chargesum: 0.0000000
charge: -0.426177 -0.428743 -0.301280 -0.302830 -0.497348 -0.497133 -0.159049 -0.161335 -0.132195 -0.147489 0.110318 0.137935 -0.167863 -0.203687 -0.137052 -0.130804 0.207620 0.192642 0.542281 0.540801 0.048476 0.054904 -0.266898 -0.275859 0.141144 0.150957 0.193829 0.217804 0.161754 0.161855 0.182204 0.191106 0.096481 0.118457 0.113464 0.099402 0.105199 0.104852 0.068555 0.090076 0.109320 0.094304
qa: -0.4262 -0.4287 -0.3013 -0.3028 -0.4973 -0.4971 -0.1590 -0.1613 -0.1322 -0.1475 0.1103 0.1379 -0.1679 -0.2037 -0.1371 -0.1308 0.2076 0.1926 0.5423 0.5408 0.0485 0.0549 -0.2669 -0.2759 0.1411 0.1510 0.1938 0.2178 0.1618 0.1619 0.1822 0.1911 0.0965 0.1185 0.1135 0.0994 0.1052 0.1049 0.0686 0.0901 0.1093 0.0943
va: 1.9770 1.9720 2.1337 2.1294 1.9993 1.9983 3.2809 3.1997 3.2304 3.2399 3.8562 3.7286 3.9965 4.0238 3.9283 3.8948 4.3237 4.3360 4.2386 4.2378 3.8188 3.8196 3.9216 3.9281 1.0343 1.0063 1.0500 1.0125 0.9893 0.9888 1.0327 1.0245 1.0078 0.9968 0.9956 1.0106 1.0110 1.0031 1.0166 1.0135 1.0109 0.9973
dispcorr: -0.025747118 hartree
energy: -1860.881739256906
dipole: -10.79001 8.42625 -2.36376 22.55505 -19.16335 3.39170 -5.16870 3.93596 -1.23274
magnitude: 4.31400 au
magnitude: 10.96532 debye
