program: Orca
programVersion: 5.0.2
elementType: S S O O O O N N N N C C C C C C C C C C C C C C H H H H H H H H H H H H H H H H H H
charge: 0
multiplicity: 1
keywords: wb97x-d3
keywords: def2-TZVPP
keywords: def2/J RIJCOSX
keywords: DEFGRID2
keywords: scfconv7
keywords: smallprint printgap noloewdin
keywords: NOSOSCF
formula: C14H18N4O4S2
InChI: InChI=1/C14H18N4O4S2/c1-3-21-13(19)17-11(23)15-9-7-5-6-8-10(9)16-12(24)18-14(20)22-4-2/h5-8,15-18H,3-4H2,1-2H3
42 atoms
S  -0.6084 -0.872051 -2.630686
S  0.608304 -0.870644 2.631625
O  1.710512 2.771603 -0.660594
O  -1.711728 2.771113 0.659213
O  2.588697 0.857523 0.12523
O  -2.589132 0.856237 -0.125549
N  1.183454 -1.296382 -0.722916
N  -1.183058 -1.296638 0.723777
N  1.005879 0.870926 -1.531787
N  -1.00636 0.871194 1.531482
C  0.589538 -2.533061 -0.377036
C  -0.588497 -2.533186 0.378524
C  1.184389 -3.730469 -0.727816
C  -1.182715 -3.730734 0.729895
C  0.594575 -4.932777 -0.355715
C  -0.592256 -4.932915 0.358407
C  0.590223 -0.441736 -1.561472
C  -0.590282 -0.441315 1.561973
C  1.839162 1.463137 -0.608564
C  -1.839825 1.462567 0.607888
C  2.453432 3.566113 0.288147
C  -2.455112 3.56481 -0.289848
C  1.807888 3.565129 1.653415
C  -1.809795 3.563349 -1.655229
H  2.101873 -3.7240 -1.300832
H  -2.100208 -3.724464 1.302897
H  1.908917 -0.938271 -0.106823
H  -1.908554 -0.939139 0.107365
H  1.061417 -5.867305 -0.635646
H  -1.058603 -5.867551 0.638802
H  0.467682 1.486899 -2.128582
H  -0.468434 1.487679 2.127999
H  2.445159 4.565017 -0.141772
H  3.488803 3.226511 0.326982
H  -2.447169 4.56395 0.139529
H  -3.490353 3.22478 -0.328332
H  1.817457 2.58106 2.122085
H  2.36409 4.243819 2.300422
H  0.779719 3.922154 1.606778
H  -0.781693 3.920611 -1.608933
H  -1.819224 2.57907 -2.123456
H  -2.366251 4.241631 -2.302444
elementType: S O N C H
totalener: -1860.85286014 hartree
nucrepener: 2616.89741721 hartree
electener: -4477.75027735 hartree
oneelecener: -7758.43839476 hartree
twoeener: 3280.68811740 hartree
cpcmener: -0.04641190 hartree
kineticenergy: 1855.10352055 hartree
xcener: -138.425086819003 hartree
chargesum: -0.0000000
charge: -0.421259 -0.421249 -0.296372 -0.296373 -0.479306 -0.479286 -0.147659 -0.147682 -0.154408 -0.154410 0.099426 0.099332 -0.196268 -0.196215 -0.118400 -0.118468 0.186148 0.186172 0.521742 0.521701 0.046631 0.046678 -0.257212 -0.257236 0.150533 0.150516 0.216265 0.216276 0.162952 0.162955 0.199489 0.199502 0.115486 0.103979 0.115484 0.103959 0.071821 0.108626 0.087843 0.087832 0.071836 0.108621
qa: -0.4213 -0.4212 -0.2964 -0.2964 -0.4793 -0.4793 -0.1477 -0.1477 -0.1544 -0.1544 0.0994 0.0993 -0.1963 -0.1962 -0.1184 -0.1185 0.1861 0.1862 0.5217 0.5217 0.0466 0.0467 -0.2572 -0.2572 0.1505 0.1505 0.2163 0.2163 0.1630 0.1630 0.1995 0.1995 0.1155 0.1040 0.1155 0.1040 0.0718 0.1086 0.0878 0.0878 0.0718 0.1086
va: 1.9788 1.9788 2.1259 2.1259 2.0193 2.0193 3.1891 3.1892 3.2481 3.2481 3.8196 3.8198 4.0526 4.0527 3.8829 3.8830 4.3608 4.3608 4.2577 4.2578 3.8116 3.8116 3.9095 3.9096 1.0086 1.0086 1.0269 1.0269 0.9886 0.9886 1.0176 1.0176 0.9957 1.0082 0.9957 1.0082 1.0264 1.0120 1.0109 1.0109 1.0264 1.0120
dispcorr: -0.028658418 hartree
energy: -1860.881518561456
dipole: -0.00381 0.00352 -0.00029 18.22303 -15.32634 2.89668 -0.00548 0.00442 -0.00106
magnitude: 2.89668 au
magnitude: 7.36279 debye
