program: Orca
programVersion: 5.0.2
elementType: S S O O O O N N N N C C C C C C C C C C C C C C H H H H H H H H H H H H H H H H H H
charge: 0
multiplicity: 1
keywords: wb97x-d3
keywords: def2-TZVPP
keywords: def2/J RIJCOSX
keywords: DEFGRID2
keywords: scfconv7
keywords: smallprint printgap noloewdin
keywords: NOSOSCF
formula: C14H18N4O4S2
InChI: InChI=1/C14H18N4O4S2/c1-3-21-13(19)17-11(23)15-9-7-5-6-8-10(9)16-12(24)18-14(20)22-4-2/h5-8,15-18H,3-4H2,1-2H3
42 atoms
S  3.384915 -2.021475 0.344873
S  -0.237473 -0.902614 2.500335
O  2.498422 2.611695 -0.134303
O  -3.064169 2.630641 0.997079
O  0.648053 1.473764 -0.711911
O  -3.174702 0.927378 -0.464081
N  1.02916 -1.189225 -0.631206
N  -1.588579 -1.122514 0.224858
N  2.607391 0.415235 -0.160669
N  -1.917905 0.807494 1.448484
C  0.33494 -2.4038 -0.554149
C  -0.990244 -2.360197 -0.105855
C  0.874881 -3.61831 -0.957852
C  -1.753738 -3.515834 -0.067085
C  0.107439 -4.772461 -0.902923
C  -1.205695 -4.727004 -0.459971
C  2.258169 -0.922643 -0.178981
C  -1.294313 -0.414699 1.318842
C  1.810906 1.513902 -0.367489
C  -2.761721 1.426609 0.559803
C  1.856269 3.88323 -0.351445
C  -3.909309 3.45896 0.175014
C  1.872447 4.283876 -1.806677
C  -3.145401 4.100296 -0.958481
H  1.887147 -3.660217 -1.329863
H  -2.777974 -3.459693 0.27878
H  0.459321 -0.374255 -0.850056
H  -2.302406 -0.756374 -0.40007
H  0.540343 -5.710666 -1.224226
H  -1.803768 -5.627647 -0.422616
H  3.557521 0.58771 0.141547
H  -1.66035 1.321064 2.281276
H  2.44047 4.579441 0.247484
H  0.84286 3.86411 0.051521
H  -4.287307 4.213775 0.861757
H  -4.760455 2.88066 -0.186961
H  2.887849 4.299643 -2.203717
H  1.264664 3.624815 -2.426122
H  1.465519 5.2918 -1.897965
H  -2.291239 4.669669 -0.590937
H  -2.791596 3.372155 -1.687183
H  -3.807183 4.793494 -1.478967
elementType: S O N C H
totalener: -1860.86453438 hartree
nucrepener: 2492.96564705 hartree
electener: -4353.83018143 hartree
oneelecener: -7511.20118934 hartree
twoeener: 3157.37100791 hartree
cpcmener: -0.03853441 hartree
kineticenergy: 1855.10412006 hartree
xcener: -138.428402752074 hartree
chargesum: -0.0000000
charge: -0.419113 -0.417288 -0.299402 -0.303608 -0.486259 -0.482914 -0.159784 -0.165236 -0.133794 -0.136890 0.101650 0.143495 -0.155091 -0.209588 -0.136331 -0.125618 0.207204 0.178598 0.530930 0.539409 0.051838 0.045481 -0.254263 -0.256724 0.139272 0.146906 0.193964 0.215955 0.157878 0.157549 0.179422 0.183276 0.113014 0.089965 0.112094 0.097364 0.090414 0.090510 0.096735 0.088208 0.091669 0.099102
qa: -0.4191 -0.4173 -0.2994 -0.3036 -0.4863 -0.4829 -0.1598 -0.1652 -0.1338 -0.1369 0.1017 0.1435 -0.1551 -0.2096 -0.1363 -0.1256 0.2072 0.1786 0.5309 0.5394 0.0518 0.0455 -0.2543 -0.2567 0.1393 0.1469 0.1940 0.2160 0.1579 0.1575 0.1794 0.1833 0.1130 0.0900 0.1121 0.0974 0.0904 0.0905 0.0967 0.0882 0.0917 0.0991
va: 1.9839 1.9857 2.1379 2.1309 2.0073 2.0186 3.2859 3.1856 3.2305 3.2348 3.8754 3.7239 3.9889 4.0396 3.9396 3.9002 4.3232 4.3382 4.2469 4.2400 3.8502 3.8454 3.9200 3.9209 1.0365 1.0077 1.0506 1.0210 0.9906 0.9903 1.0353 1.0321 0.9946 1.0099 0.9948 1.0084 1.0050 1.0118 1.0067 1.0029 1.0128 1.0074
dispcorr: -0.022749550 hartree
energy: -1860.887283934134
dipole: -9.24295 7.15643 -2.08652 23.14674 -19.68193 3.46481 -11.69523 10.13361 -1.56162
magnitude: 4.33556 au
magnitude: 11.02013 debye
