program: Gaussian 09
title: 000066089
version: EM64L-G09RevD.01
frameworkgroup: C1[X(C6H6N4O)]
method: RPBEPBE
basis: SDD
operation: Freq
keyword: #pfreq=noraman
keyword: PBEPBE/SDD
title: #p freq=noraman PBEPBE/SDD
converged: NO NO NO NO
title: Mulliken charges:
elementType: O N N N N C C C C C C H H H H H H
charge: -0.247416 -0.142139 -0.314092 -0.077918 0.000042 0.113155 0.078984 -0.215054 0.046598 -0.598512 -0.244237 0.268884 0.266655 0.218608 0.266628 0.333378 0.246436
chargesum: 0.00000
title: Mulliken charges with hydrogens summed into heavy atoms:
elementType: O N N N N C C C C C C
charge: -0.247416 -0.142139 0.019286 -0.077918 0.000042 0.113155 0.078984 0.053830 0.046598 0.153379 0.002199
polarizability: 1.15763317e+02 -1.03543763e+00 1.12528844e+02 -6.77714141e-03 5.34450746e-03 4.25807127e+01
1716.lowfreq: -46.8674 -7.3719 -0.0004 0.0008 0.0009 5.3348 15.1358 101.5182 186.1764
frequency: -46.3386 101.5173 186.1757 191.5826 216.0491 319.3382 375.3499 486.2332 506.0245 512.9437 578.0068 615.2046 629.6378 659.1543 678.8328 722.2818 774.3546 807.9434 855.7069 900.5788 959.3775 1044.0452 1063.3095 1119.3353 1125.5830 1188.4684 1260.0804 1306.2000 1326.5489 1355.9703 1362.4422 1409.8067 1456.2131 1469.2498 1484.2670 1499.3574 1520.5568 1577.3758 1609.4652 3013.0785 3114.1533 3121.3449 3139.0588 3241.1766 3545.5509
redmass: 1.1268 3.8340 4.3239 6.0574 3.9254 4.9081 5.4182 8.9125 5.8810 3.7474 5.9692 2.8976 1.2878 8.1396 9.0660 6.8566 6.7332 1.5557 7.9171 1.4435 7.6313 2.0841 2.9330 2.6765 1.3245 1.9101 3.2019 3.8622 4.2886 2.6607 1.5785 2.0206 1.0391 1.7782 1.1336 5.4996 3.5085 6.4976 11.3090 1.0329 1.1024 1.1032 1.0927 1.0990 1.0794
irintensity: 1.2001 6.5253 6.8235 1.0516 12.1153 8.8921 1.9471 4.0148 2.7158 3.4600 3.3962 71.5456 62.9363 3.0270 1.4937 3.1165 0.3272 26.5028 1.3896 10.9435 61.1238 14.1548 5.8981 5.0298 0.9419 44.6321 12.7669 1.8446 6.6013 23.4662 40.2738 22.5019 16.1619 70.9414 27.8631 100.5357 50.4994 38.4277 449.7351 26.1019 8.5687 9.4111 18.8783 1.1281 73.4762
temp: 298.150 k
press: 1.00000 atm
elementType: 8 7 7 7 7 6 6 6 6 6 6 1 1 1 1 1 1
symmnumber: 1
zpe: 325557.3 jmol-1
zpe.correction: 0.123998 hartree
zpe.thermalcorrener: 0.132017 hartree
zpe.thermalcorrenthalpy: 0.132961 hartree
zpe.thermalcorrgfe: 0.090903 hartree
zpe.sumelectzpe: -525.684185 hartree
zpe.sumelectthermal: -525.676166 hartree
zpe.sumelectthermalent: -525.675222 hartree
zpe.sumelectthermalfe: -525.717280 hartree
dipole: -2.0577 -4.2997 0.0008
dipole: 4.7667
quadrupole: -45.9652 -77.8266 -63.9937
quadrupole: -13.7864 -0.0033 0.0026
quadrupole: 16.6300 -15.2314 -1.3985 -13.7864 -0.0033 0.0026
hfenergy: -525.808183 hartree
pointgroup: C01 [X(C6H6N4O1)]
dipole: 1.1833222 -1.4549067 -0.0003252 debye
dipolederiv: -0.4834143 -0.1033763 0.0000168 0.0713068 -1.259597 0.0001276 -0.0000063 -0.0001532 -0.3617348 -0.3306769 -0.1499518 0.0000048 -0.218493 -0.5687293 0.0000686 -0.0000998 -0.0000863 -0.0928183 -0.7297549 0.0475385 0.0000442 0.1187171 -0.6838348 0.0000365 0.0000554 0.0000247 -0.2115025 -0.6302484 -0.2689092 0.0000599 -0.0406866 -0.4423526 0.0000286 0.000016 0.000053 -0.2471147 -0.5538681 -0.4376439 0.0000153 -0.0704957 -0.9663005 0.0000664 0.000044 0.0001004 -0.2871043 -0.03204 0.4850516 0.0000054 0.2930998 -0.5614406 0.0000748 -0.0000153 0.0001124 0.010476 0.7412298 0.2360605 -0.0000734 -0.0510158 0.3063404 -0.0000576 -0.0000664 -0.0000296 0.0621362 0.0853891 0.1626142 0.0000416 0.1792426 0.6448723 -0.000078 0.0001082 -0.0000571 -0.0817306 0.9046863 0.1654317 -0.0000348 -0.0284147 1.6889111 -0.0001222 -0.0000049 0.0000243 0.249134 0.2939587 0.1477616 -0.0000464 0.1864122 0.3265217 -0.0000853 -0.0000384 -0.0000219 0.1874832 0.5287708 -0.2273684 -0.0000467 -0.2893101 1.0640448 -0.0000895 -0.0000202 -0.0000423 0.0039375 -0.0006558 -0.0151762 -0.0000046 -0.0256547 0.1132214 0.0000042 -0.0000373 0.0000102 0.1847112 0.0881848 0.0154961 0.0637996 -0.052379 0.0157995 -0.0475136 0.0186795 -0.0698794 -0.0163183 -0.1212085 -0.0204438 0.0000346 0.0956135 0.0673616 0.0000125 0.0000155 0.000029 0.1241842 0.088118 0.0154575 -0.0638638 -0.0523905 0.015848 0.0474879 -0.018674 0.0698806 -0.0164153 0.1762429 0.041989 0.000013 0.0047972 0.2324138 0.0000165 0.0000139 -0.0000071 0.3525862 -0.0247136 -0.094531 0.0000345 -0.120349 0.0069201 0.0000226 0.00003 0.0000423 0.1400901 unknown
polarizability: 115.1141872|1.6584195|113.177974|-0.0053365|-0.0067834|42.5807127 unknown
InChI: InChI=1S/C6H6N4O/c1-10-3-9-5-4(10)6(11)8-2-7-5/h2-3,7H,1H3
charge 0 multiplicity 1
17 atoms
O  -0.788202 2.426333 -0.000307
N  1.582325 0.381236 -0.000483
N  -1.279297 -1.706711 -0.000133
N  1.209973 -1.881923 -0.000244
N  -2.211028 0.526309 -0.000293
C  0.189188 0.209751 -0.000521
C  0.009497 -1.189724 -0.000304
C  2.140845 -0.891196 -0.000367
C  -0.917174 1.165522 -0.000602
C  2.298913 1.667211 -0.001037
C  -2.3315 -0.789504 -0.000125
H  3.215714 -1.056474 -0.000273
H  2.026764 2.255069 0.889827
H  3.383298 1.46983 -0.001135
H  2.026495 2.254432 -0.892242
H  -1.437123 -2.716745 -0.000009
H  -3.334487 -1.231416 0.000049
