program: Gaussian 09
title: 000066134
version: EM64L-G09RevD.01
frameworkgroup: C1[X(C12H17N2OP)]
method: RPBEPBE
basis: SDD
operation: Freq
keyword: #p
keyword: freq=noraman
keyword: PBEPBE/SDD
title: #p freq=noraman PBEPBE/SDD
converged: YES YES NO NO
title: Mulliken charges:
elementType: P O N N C C C C C C C C C C C C H H H H H H H H H H H H H H H H H
charge: 1.048673 -0.643190 -0.433301 -0.434461 -0.025576 -0.008454 -0.449393 -0.456100 -0.101438 -0.703828 -0.704137 -0.248811 -0.319399 -0.222098 -0.210187 -0.224341 0.271896 0.259111 0.239932 0.258679 0.241397 0.265048 0.213014 0.228470 0.228516 0.226156 0.212555 0.230026 0.276749 0.286672 0.233061 0.233255 0.231504
chargesum: 0.00000
title: Mulliken charges with hydrogens summed into heavy atoms:
elementType: P O N N C C C C C C C C C C C C
charge: 1.048673 -0.643190 -0.433301 -0.434461 0.246320 0.250657 0.049218 0.050345 -0.101438 -0.033829 -0.035399 0.027937 -0.032727 0.010962 0.023068 0.007163
polarizability: 2.04497171e+02 5.74127961e+00 1.47583804e+02 -1.22384970e+00 -4.08384026e-01 1.45244206e+02
1716.lowfreq: -8.3890 -6.8133 -0.0014 -0.0004 0.0009 7.1757 21.9625 30.6789 38.1093
frequency: 21.7438 30.6673 37.9229 54.2813 66.5065 89.4437 150.8106 154.5269 162.3600 193.4007 204.9106 229.4905 236.1756 258.1553 294.8449 324.3706 366.3091 393.9533 398.0993 398.2246 436.4163 485.3235 500.3395 568.2867 606.3231 611.5795 700.9570 703.2965 733.3623 748.4472 765.9167 832.4860 838.2777 862.6598 896.8574 898.0971 936.7329 958.3316 970.2828 983.2428 986.1113 987.6476 1005.4267 1021.8013 1026.2638 1027.9460 1065.7360 1069.3851 1077.4611 1100.2332 1112.8905 1117.8560 1138.0269 1140.1748 1165.5030 1169.3223 1173.6985 1186.5222 1234.7039 1240.1030 1311.8144 1374.3734 1374.5364 1381.2189 1397.5672 1398.1752 1428.0506 1453.9633 1455.4284 1463.7226 1464.7633 1466.0414 1474.0351 1475.0064 1588.9245 1597.5787 2984.1329 2984.8761 3067.1729 3068.8396 3072.7637 3073.5543 3076.1019 3077.4944 3099.8699 3100.2841 3127.7666 3136.9944 3147.6485 3159.5319 3170.0009 3180.5743 3182.3548
redmass: 3.5383 3.6832 3.6327 3.8790 3.0742 3.3635 4.2824 3.2835 3.8312 1.2558 1.2048 3.4186 3.4582 5.5749 4.3365 4.4904 4.3508 2.3275 2.4683 2.7558 4.1413 3.7521 5.8144 6.7905 6.7071 6.4755 6.8177 1.9501 3.9131 4.2202 1.7354 3.9222 3.6921 1.2464 1.2531 1.2712 1.3692 3.9481 2.3169 2.9651 1.3849 6.0279 1.3204 2.7371 1.3701 1.2843 1.3807 1.3990 1.6190 2.9475 1.2947 1.2922 1.4658 1.4671 1.8071 1.7618 1.0571 1.1277 1.6818 1.6888 1.3084 1.5313 1.5378 8.5567 1.4743 1.4672 2.1207 1.1279 1.1204 1.1141 1.1177 2.0075 1.0467 1.0461 6.1977 5.8460 1.0359 1.0359 1.0570 1.0595 1.0875 1.0851 1.0984 1.0986 1.0986 1.0987 1.0853 1.0888 1.0932 1.0968 1.1007 1.1174 1.1174
irintensity: 0.5774 1.0665 1.5381 0.2149 0.7177 1.9251 11.9568 0.2760 10.0174 1.7232 0.3524 6.6454 4.7364 2.7691 6.0632 6.2433 0.2712 6.8343 3.8944 0.0558 1.8000 10.8662 42.1797 53.2401 111.2297 0.6465 22.7204 59.4529 15.4788 16.3529 19.5906 173.0189 75.8391 0.0934 5.5333 2.7534 0.3489 44.2041 62.7708 43.2400 0.2724 3.3131 0.1130 5.6957 35.9677 45.9353 6.3163 6.7075 2.0135 41.4853 4.7602 12.4060 8.6706 6.3930 4.1587 8.6376 0.0438 4.7090 27.5011 10.7124 3.4933 12.4876 7.4783 0.7394 31.3882 30.7458 19.9370 14.3439 8.0136 10.2224 13.4338 5.6233 9.3930 8.3707 0.0066 0.2020 33.3550 26.7723 14.7834 18.1575 4.0857 3.8599 33.9853 30.9678 27.8024 25.6765 0.5161 5.2799 11.2718 22.7390 20.8888 6.6829 6.6315
temp: 298.150 k
press: 1.00000 atm
elementType: 15 8 7 7 6 6 6 6 6 6 6 6 6 6 6 6 1 1 1 1 1 1 1 1 1 1 1 1 1 1 1 1 1
symmnumber: 1
zpe: 699608.4 jmol-1
zpe.correction: 0.266467 hartree
zpe.thermalcorrener: 0.283761 hartree
zpe.thermalcorrenthalpy: 0.284705 hartree
zpe.thermalcorrgfe: 0.219440 hartree
zpe.sumelectzpe: -992.127885 hartree
zpe.sumelectthermal: -992.110590 hartree
zpe.sumelectthermalent: -992.109646 hartree
zpe.sumelectthermalfe: -992.174912 hartree
dipole: -0.3436 0.2232 -1.6502
dipole: 1.7003
quadrupole: -86.1632 -95.3035 -108.6227
quadrupole: 0.9690 -1.5689 0.0493
quadrupole: 10.5333 1.3930 -11.9263 0.9690 -1.5689 0.0493
hfenergy: -992.3943515 hartree
pointgroup: C01 [X(C12H17N2O1P1)]
dipole: -0.1116065 -0.1096136 0.6504134 debye
polarizability: 203.8886293|8.1959938|148.1837942|1.314094|-0.1211643|145.2527572 unknown
InChI: InChI=1S/C12H17N2OP/c1-10-8-13(10)16(15,14-9-11(14)2)12-6-4-3-5-7-12/h3-7,10-11H,8-9H2,1-2H3
charge 0 multiplicity 1
33 atoms
P  0.51402 0.15788 -0.607536
O  0.814319 0.135399 -2.197405
N  1.277671 -1.151491 0.359284
N  1.10845 1.588817 0.299235
C  1.356946 -2.530014 -0.28961
C  2.450018 2.185065 -0.112626
C  2.60978 -1.68682 -0.150443
C  1.162213 2.90271 -0.468632
C  -1.281408 0.057053 -0.181108
C  1.059973 -3.705175 0.619935
C  3.347926 2.631718 1.023486
C  -1.708648 0.088281 1.166791
C  -2.211778 -0.048421 -1.240261
C  -3.089713 0.009244 1.453622
C  -3.591603 -0.126481 -0.944496
C  -4.029395 -0.098288 0.400391
H  0.96194 -2.596367 -1.31434
H  2.949639 1.696406 -0.962438
H  3.329944 -1.909033 0.643799
H  3.019605 -1.247957 -1.069724
H  0.841234 3.769886 0.117492
H  0.856497 2.891167 -1.523103
H  1.505229 -4.632512 0.213526
H  1.472647 -3.527525 1.627858
H  -0.029767 -3.858285 0.718819
H  3.89398 1.771948 1.452006
H  4.088673 3.371333 0.666098
H  2.751056 3.091384 1.829787
H  -0.970213 0.1760 1.96999
H  -1.846304 -0.065145 -2.27353
H  -3.432577 0.033004 2.493773
H  -4.320584 -0.207497 -1.758127
H  -5.099869 -0.158287 0.627685
