program: Orca
programVersion: 5.0.2
elementType: S S O O O O N N N N C C C C C C C C C C C C C C H H H H H H H H H H H H H H H H H H
charge: 0
multiplicity: 1
keywords: wb97x-d3
keywords: def2-TZVPP
keywords: def2/J RIJCOSX
keywords: DEFGRID2
keywords: scfconv7
keywords: smallprint printgap noloewdin
keywords: NOSOSCF
formula: C14H18N4O4S2
InChI: InChI=1/C14H18N4O4S2/c1-3-21-13(19)17-11(23)15-9-7-5-6-8-10(9)16-12(24)18-14(20)22-4-2/h5-8,15-18H,3-4H2,1-2H3
42 atoms
S  -0.594793 -0.891929 -2.657149
S  0.595563 -0.891447 2.657855
O  1.692568 2.750528 -0.641831
O  -1.694033 2.750423 0.644203
O  2.568025 0.834947 0.141403
O  -2.566275 0.834731 -0.142435
N  1.175455 -1.319244 -0.729703
N  -1.173002 -1.319445 0.729018
N  0.987351 0.853543 -1.51682
N  -0.986781 0.853303 1.516959
C  0.583618 -2.557788 -0.388411
C  -0.580174 -2.557896 0.388937
C  1.167877 -3.754752 -0.758332
C  -1.162649 -3.7550 0.761182
C  0.586039 -4.956341 -0.372558
C  -0.578882 -4.956479 0.377966
C  0.588997 -0.463697 -1.57224
C  -0.587698 -0.4637 1.572161
C  1.822685 1.441148 -0.593087
C  -1.822234 1.440924 0.593366
C  2.468404 3.545805 0.276864
C  -2.470444 3.546162 -0.273572
C  1.859152 3.5779 1.658356
C  -1.860399 3.581592 -1.654651
H  2.071285 -3.745857 -1.354342
H  -2.065962 -3.746277 1.357341
H  1.906045 -0.965719 -0.116379
H  -1.902859 -0.966223 0.114632
H  1.044298 -5.891415 -0.666492
H  -1.035573 -5.891657 0.673985
H  0.478002 1.467478 -2.139659
H  -0.478339 1.467188 2.140588
H  2.465465 4.539148 -0.167153
H  3.499156 3.190199 0.298155
H  -2.469247 4.53873 0.172216
H  -3.500671 3.189081 -0.296166
H  2.439623 4.263471 2.276869
H  0.833321 3.94547 1.633508
H  1.874921 2.604137 2.146452
H  -2.441595 4.267277 -2.272363
H  -0.835143 3.950695 -1.628573
H  -1.874418 2.608612 -2.144382
elementType: S O N C H
totalener: -1860.85986420 hartree
nucrepener: 2613.83028057 hartree
electener: -4474.69014477 hartree
oneelecener: -7752.39288280 hartree
twoeener: 3277.70273803 hartree
cpcmener: -0.03906365 hartree
kineticenergy: 1855.10983468 hartree
xcener: -138.424714264508 hartree
chargesum: -0.0000000
charge: -0.409198 -0.409243 -0.295809 -0.295843 -0.457739 -0.457762 -0.150176 -0.150096 -0.152766 -0.152771 0.102168 0.102251 -0.191228 -0.191261 -0.115024 -0.114976 0.177068 0.177024 0.505685 0.505701 0.045573 0.045554 -0.257361 -0.257413 0.147427 0.147423 0.214731 0.214729 0.158777 0.158757 0.193155 0.193192 0.113454 0.102848 0.113450 0.102842 0.106666 0.086416 0.075293 0.106638 0.086448 0.075400
qa: -0.4092 -0.4092 -0.2958 -0.2958 -0.4577 -0.4578 -0.1502 -0.1501 -0.1528 -0.1528 0.1022 0.1023 -0.1912 -0.1913 -0.1150 -0.1150 0.1771 0.1770 0.5057 0.5057 0.0456 0.0456 -0.2574 -0.2574 0.1474 0.1474 0.2147 0.2147 0.1588 0.1588 0.1932 0.1932 0.1135 0.1028 0.1135 0.1028 0.1067 0.0864 0.0753 0.1066 0.0864 0.0754
va: 1.9928 1.9927 2.1230 2.1229 2.0436 2.0436 3.1847 3.1848 3.2394 3.2394 3.8225 3.8223 4.0577 4.0584 3.8908 3.8909 4.3693 4.3693 4.2725 4.2725 3.8183 3.8183 3.9090 3.9092 1.0094 1.0094 1.0282 1.0282 0.9900 0.9900 1.0227 1.0227 0.9953 1.0084 0.9953 1.0084 1.0122 1.0103 1.0255 1.0122 1.0102 1.0255
dispcorr: -0.028517833 hartree
energy: -1860.888382028695
dipole: -0.00369 0.00376 0.00007 18.38758 -15.62899 2.75859 0.01476 -0.01282 0.00194
magnitude: 2.75859 au
magnitude: 7.01177 debye
