program: Orca
programVersion: 5.0.2
elementType: S S O O O O N N N N C C C C C C C C C C C C C C H H H H H H H H H H H H H H H H H H
charge: 0
multiplicity: 1
keywords: wb97x-d3
keywords: def2-TZVPP
keywords: def2/J RIJCOSX
keywords: DEFGRID2
keywords: scfconv7
keywords: smallprint printgap noloewdin
keywords: NOSOSCF
formula: C14H18N4O4S2
InChI: InChI=1/C14H18N4O4S2/c1-3-21-13(19)17-11(23)15-9-7-5-6-8-10(9)16-12(24)18-14(20)22-4-2/h5-8,15-18H,3-4H2,1-2H3
42 atoms
S  0.720451 -0.44335 2.306442
S  -3.29747 -2.057918 1.227863
O  3.166105 2.653253 -0.375735
O  -2.73276 2.447055 -0.115553
O  2.907212 0.741205 -1.520471
O  -0.938552 1.285104 -0.800063
N  1.537319 -1.112835 -0.132479
N  -1.203463 -1.359511 -0.301115
N  2.106705 0.996056 0.614155
N  -2.739327 0.273177 0.20486
C  0.940506 -2.393643 -0.079497
C  -0.449008 -2.5321 -0.179808
C  1.752271 -3.515412 -0.021087
C  -1.001318 -3.80667 -0.219481
C  1.193861 -4.783892 -0.044199
C  -0.181886 -4.92298 -0.143779
C  1.481759 -0.208997 0.850479
C  -2.338042 -1.043776 0.330693
C  2.746224 1.415773 -0.526819
C  -2.035437 1.34545 -0.285159
C  3.888633 3.251685 -1.469995
C  -2.157636 3.688844 -0.566131
C  4.309174 4.631293 -1.03727
C  -3.154647 4.779474 -0.27358
H  2.824653 -3.386251 0.051339
H  -2.067962 -3.928834 -0.325838
H  2.094415 -0.887016 -0.95258
H  -0.722123 -0.579402 -0.744061
H  1.831823 -5.655803 0.009503
H  -0.62868 -5.907884 -0.177837
H  2.044504 1.654709 1.379336
H  -3.631158 0.473314 0.638897
H  3.242882 3.295799 -2.349022
H  4.757243 2.63667 -1.712341
H  -1.947041 3.625906 -1.635253
H  -1.217709 3.864814 -0.039914
H  4.863391 5.100183 -1.850658
H  3.451173 5.264753 -0.810906
H  4.962667 4.599847 -0.165035
H  -2.742083 5.732596 -0.604619
H  -4.093942 4.62087 -0.804022
H  -3.36445 4.860437 0.793243
elementType: S O N C H
totalener: -1860.86610860 hartree
nucrepener: 2456.04955152 hartree
electener: -4316.91566013 hartree
oneelecener: -7437.42209139 hartree
twoeener: 3120.50643126 hartree
cpcmener: -0.03888664 hartree
kineticenergy: 1855.09676890 hartree
xcener: -138.425823930389 hartree
chargesum: 0.0000000
charge: -0.416403 -0.417899 -0.298411 -0.293081 -0.481731 -0.482519 -0.162713 -0.158262 -0.134178 -0.134743 0.136993 0.107247 -0.208034 -0.153940 -0.128112 -0.138096 0.177490 0.208013 0.538663 0.528643 0.039621 0.040586 -0.247450 -0.247824 0.146290 0.140258 0.214223 0.193939 0.157622 0.157818 0.182421 0.178855 0.105835 0.102485 0.103465 0.103375 0.089999 0.089605 0.089831 0.090073 0.089663 0.090382
qa: -0.4164 -0.4179 -0.2984 -0.2931 -0.4817 -0.4825 -0.1627 -0.1583 -0.1342 -0.1347 0.1370 0.1072 -0.2080 -0.1539 -0.1281 -0.1381 0.1775 0.2080 0.5387 0.5286 0.0396 0.0406 -0.2474 -0.2478 0.1463 0.1403 0.2142 0.1939 0.1576 0.1578 0.1824 0.1789 0.1058 0.1025 0.1035 0.1034 0.0900 0.0896 0.0898 0.0901 0.0897 0.0904
va: 1.9852 1.9839 2.1313 2.1350 2.0232 2.0156 3.1883 3.2917 3.2344 3.2268 3.7273 3.8756 4.0387 3.9813 3.9039 3.9450 4.3326 4.3216 4.2409 4.2502 3.8301 3.8304 3.9726 3.9744 1.0077 1.0394 1.0220 1.0492 0.9902 0.9908 1.0324 1.0354 0.9952 0.9966 0.9961 0.9961 1.0065 1.0028 1.0030 1.0063 1.0030 1.0030
dispcorr: -0.021335934 hartree
energy: -1860.887444537177
dipole: 8.19445 -6.45049 1.74396 24.28874 -21.14639 3.14236 -9.79419 7.50290 -2.29129
magnitude: 4.26214 au
magnitude: 10.83350 debye
