program: Gaussian 09
title: 000066159
version: EM64L-G09RevD.01
frameworkgroup: C1[X(C15H14O3)]
method: RPBEPBE
basis: SDD
operation: Freq
keyword: #pfreq=noraman
keyword: PBEPBE/SDD
title: #p freq=noraman PBEPBE/SDD
converged: YES YES NO NO
title: Mulliken charges:
elementType: O O O C C C C C C C C C C C C C C C H H H H H H H H H H H H H H
charge: -0.467932 -0.254962 -0.244184 -0.092161 0.354513 0.421552 0.175566 -0.395333 -0.374771 -0.373869 -0.372054 -0.237956 -0.227434 -0.225635 -0.239937 -0.239822 -0.239590 -0.504218 0.267720 0.269964 0.282568 0.253561 0.367981 0.225234 0.224975 0.227636 0.224206 0.228880 0.227056 0.239797 0.246559 0.252089
chargesum: 0.00000
title: Mulliken charges with hydrogens summed into heavy atoms:
elementType: O O O C C C C C C C C C C C C C C C
charge: -0.099951 -0.254962 -0.244184 -0.092161 0.354513 0.421552 0.175566 -0.127613 -0.104807 -0.091301 -0.118493 -0.012722 -0.002459 0.002001 -0.015730 -0.010942 -0.012535 0.234228
polarizability: 1.93393804e+02 -2.79109212e+00 1.42343352e+02 -9.85382507e+00 2.49290996e+00 1.53529944e+02
1716.lowfreq: -12.9700 -11.9402 -7.9442 -0.0008 -0.0007 -0.0005 1.9478 38.8899 58.5029
frequency: -10.0937 38.7780 58.4953 61.3169 71.5449 103.3206 108.6359 182.7866 206.4373 225.1023 252.1014 275.6736 289.9991 321.7050 350.8237 362.2662 401.9408 406.0813 434.7231 469.1557 513.0922 562.1492 595.1817 615.2082 616.1396 662.5402 696.0958 702.8850 710.1817 732.2893 765.4916 774.3759 854.6725 864.3610 878.9435 901.6369 923.9131 941.6327 955.0077 980.5258 988.0124 990.5214 990.8483 995.6702 1000.7585 1013.5512 1028.7004 1030.9494 1082.9434 1094.6202 1113.0538 1146.4197 1150.5705 1171.1998 1171.6870 1182.5403 1186.6171 1193.4478 1200.8632 1313.8685 1319.6639 1342.2131 1378.4203 1381.8845 1420.0797 1431.8490 1434.9838 1453.4929 1461.7593 1476.7935 1478.7776 1589.2946 1593.2517 1603.0437 1606.8305 1615.4000 3011.0117 3117.1561 3123.3701 3123.7944 3134.6691 3135.3718 3149.5984 3151.4368 3158.9156 3160.7001 3163.3461 3172.3745 3173.5630 3454.6926
redmass: 3.8523 3.8762 4.9064 5.0838 4.1420 1.6754 1.8515 4.4359 4.7940 5.0110 4.6494 5.0634 4.7595 3.3092 5.0730 7.3116 2.7944 2.8645 1.4095 3.9009 3.7327 5.6832 6.8535 6.3871 6.4108 5.7932 6.1945 1.8994 1.8989 3.6227 1.8104 2.2624 1.2493 1.2495 5.0636 3.7524 1.8440 1.8379 2.8103 1.3986 2.0617 4.8629 2.6148 1.3727 1.3233 5.7732 2.2249 2.1638 1.5903 1.6997 1.2646 2.6563 1.4710 1.0558 1.0737 4.2118 1.3140 1.1599 2.8853 1.3336 1.3373 1.4302 8.5654 9.1765 1.1974 2.2015 2.2239 1.0504 1.0541 2.1455 2.2270 6.2150 6.3311 7.4985 6.0726 6.8975 1.0291 1.1051 1.0848 1.0848 1.0890 1.0893 1.0933 1.0939 1.1055 1.0975 1.0958 1.0976 1.0970 1.0647
irintensity: 0.0101 0.4747 0.0490 1.7003 1.1813 1.0281 1.5244 0.8389 3.4713 0.7138 4.7452 1.5909 4.3904 64.9545 1.1671 12.9869 1.4523 2.2572 78.4882 11.9039 8.1672 1.4911 27.1460 0.0821 0.5327 23.6896 8.6233 47.4813 46.8786 50.0044 43.3700 23.8678 0.4652 0.0055 7.6575 11.9622 12.9524 4.8616 15.2053 0.1827 0.5564 0.4979 1.7307 3.1922 0.2644 68.0666 10.7698 11.0648 1.0968 0.7281 0.0801 115.7050 4.6618 0.2505 4.8038 161.5323 16.6836 2.5296 26.8691 0.1383 2.4090 57.6789 0.1790 0.4889 20.0800 5.2992 21.4048 14.5551 9.7051 23.2996 23.9868 1.6393 0.8194 102.7609 16.0746 54.3556 27.8146 19.2742 0.0939 0.1523 10.7466 18.0819 25.0741 23.5761 10.1776 17.9226 19.3566 13.3879 10.6249 47.0632
temp: 298.150 k
press: 1.00000 atm
elementType: 8 8 8 6 6 6 6 6 6 6 6 6 6 6 6 6 6 6 1 1 1 1 1 1 1 1 1 1 1 1 1 1
symmnumber: 1
zpe: 656341.9 jmol-1
zpe.correction: 0.249987 hartree
zpe.thermalcorrener: 0.265448 hartree
zpe.thermalcorrenthalpy: 0.266392 hartree
zpe.thermalcorrgfe: 0.206700 hartree
zpe.sumelectzpe: -804.371978 hartree
zpe.sumelectthermal: -804.356518 hartree
zpe.sumelectthermalent: -804.355574 hartree
zpe.sumelectthermalfe: -804.415266 hartree
dipole: 0.1226 1.2009 -2.7705
dipole: 3.0221
quadrupole: -94.8839 -98.8214 -100.3537
quadrupole: -3.1086 -1.2650 -5.8176
quadrupole: 3.1357 -0.8017 -2.3340 -3.1086 -1.2650 -5.8176
hfenergy: -804.6219657 hartree
pointgroup: C01 [X(C15H14O3)]
dipole: 0.2128737 -0.6002278 -1.0040422 debye
polarizability: 188.3869791|6.824555|142.831204|15.6126144|1.7203039|158.048917 unknown
InChI: InChI=1S/C15H14O3/c1-18-14(16)15(17,12-8-4-2-5-9-12)13-10-6-3-7-11-13/h2-11,17H,1H3
charge 0 multiplicity 1
32 atoms
O  -0.234701 -0.014207 2.342575
O  0.967282 -2.060888 -0.428137
O  0.243057 -2.56429 1.719899
C  -0.028093 -0.245845 0.908776
C  -1.356308 -0.010459 0.144631
C  1.113737 0.691068 0.455551
C  0.403345 -1.739494 0.785997
C  -1.658215 -0.625986 -1.095945
C  2.136217 1.016401 1.380792
C  -2.290248 0.892223 0.7123
C  1.181015 1.206447 -0.860312
C  -2.879401 -0.347984 -1.752294
C  3.214548 1.84081 0.992029
C  -3.505665 1.173074 0.051695
C  2.26005 2.032166 -1.247675
C  -3.806986 0.552726 -1.1832
C  3.28268 2.350453 -0.325221
C  1.400761 -3.475846 -0.588514
H  -0.944932 -1.319406 -1.553042
H  2.059138 0.64272 2.405794
H  -2.051921 1.354301 1.674554
H  0.390894 0.974866 -1.580784
H  -0.470309 -0.893404 2.751532
H  -3.103325 -0.835681 -2.707909
H  3.996609 2.090298 1.718179
H  -4.21805 1.873578 0.502038
H  2.298554 2.430117 -2.268051
H  -4.752904 0.767184 -1.693158
H  4.117589 2.993163 -0.626805
H  1.823869 -3.522001 -1.600892
H  0.536134 -4.151252 -0.479336
H  2.15788 -3.721354 0.173733
