program: Orca
programVersion: 5.0.2
elementType: S S O O O O N N N N C C C C C C C C C C C C C C H H H H H H H H H H H H H H H H H H
charge: 0
multiplicity: 1
keywords: wb97x-d3
keywords: def2-TZVPP
keywords: def2/J RIJCOSX
keywords: DEFGRID2
keywords: scfconv7
keywords: smallprint printgap noloewdin
keywords: NOSOSCF
formula: C14H18N4O4S2
InChI: InChI=1/C14H18N4O4S2/c1-3-21-13(19)17-11(23)15-9-7-5-6-8-10(9)16-12(24)18-14(20)22-4-2/h5-8,15-18H,3-4H2,1-2H3
42 atoms
S  1.502883 -1.405623 -2.948712
S  -2.806655 -1.76147 2.594078
O  2.579188 2.832983 -1.088801
O  -2.928936 2.573064 0.685062
O  1.772577 1.518849 0.54834
O  -1.397318 1.353574 -0.419357
N  1.245549 -0.989457 -0.332706
N  -1.362429 -1.207746 0.398795
N  2.063133 0.760965 -1.597901
N  -2.731179 0.448483 1.21315
C  0.714615 -2.277461 -0.095609
C  -0.616086 -2.3921 0.317983
C  1.505125 -3.407905 -0.234201
C  -1.145228 -3.654504 0.567349
C  0.97837 -4.659937 0.031364
C  -0.347294 -4.777574 0.426745
C  1.594833 -0.533913 -1.539285
C  -2.24946 -0.842251 1.329002
C  2.112741 1.704176 -0.600002
C  -2.27131 1.466746 0.414617
C  2.757407 3.953268 -0.200671
C  -2.514535 3.792054 0.037312
C  4.026283 3.843167 0.608781
C  -1.316559 4.40301 0.72197
H  2.535778 -3.298855 -0.543418
H  -2.179374 -3.759823 0.855966
H  1.30119 -0.343424 0.451544
H  -1.095086 -0.476108 -0.257524
H  1.599626 -5.539342 -0.072862
H  -0.771553 -5.753556 0.622036
H  2.347009 1.055808 -2.523225
H  -3.436983 0.686844 1.897979
H  1.879889 4.069376 0.436548
H  2.799513 4.811691 -0.868447
H  -3.382009 4.444239 0.117654
H  -2.327912 3.610348 -1.021647
H  4.16258 4.767874 1.171034
H  3.995224 3.022963 1.324889
H  4.898484 3.715351 -0.032907
H  -0.43238 3.769887 0.650077
H  -1.082764 5.35493 0.243429
H  -1.518407 4.601006 1.775057
elementType: S O N C H
totalener: -1860.86419701 hartree
nucrepener: 2460.78620702 hartree
electener: -4321.65040403 hartree
oneelecener: -7446.09795001 hartree
twoeener: 3124.44754598 hartree
cpcmener: -0.03686856 hartree
kineticenergy: 1855.10014999 hartree
xcener: -138.427069547884 hartree
chargesum: 0.0000000
charge: -0.423915 -0.421748 -0.301993 -0.300394 -0.489840 -0.484997 -0.188847 -0.162345 -0.136269 -0.147222 0.129127 0.095769 -0.164196 -0.154965 -0.135280 -0.135550 0.198701 0.211719 0.537903 0.534238 0.048997 0.050305 -0.256341 -0.237989 0.148265 0.142612 0.217498 0.197743 0.157588 0.158526 0.180820 0.180114 0.093944 0.113280 0.112862 0.095861 0.096835 0.091547 0.091738 0.064433 0.097770 0.093695
qa: -0.4239 -0.4217 -0.3020 -0.3004 -0.4898 -0.4850 -0.1888 -0.1623 -0.1363 -0.1472 0.1291 0.0958 -0.1642 -0.1550 -0.1353 -0.1355 0.1987 0.2117 0.5379 0.5342 0.0490 0.0503 -0.2563 -0.2380 0.1483 0.1426 0.2175 0.1977 0.1576 0.1585 0.1808 0.1801 0.0939 0.1133 0.1129 0.0959 0.0968 0.0915 0.0917 0.0644 0.0978 0.0937
va: 1.9784 1.9787 2.1329 2.1376 2.0025 2.0170 3.2226 3.2968 3.2493 3.2376 3.7206 3.8562 4.0161 3.9600 3.9300 3.9389 4.3404 4.3236 4.2386 4.2503 3.8517 3.8457 3.9264 3.9199 1.0084 1.0374 1.0203 1.0418 0.9904 0.9901 1.0344 1.0346 0.9988 0.9944 0.9953 1.0098 1.0063 1.0118 1.0049 1.0152 1.0076 1.0068
dispcorr: -0.022289126 hartree
energy: -1860.886486140464
dipole: 8.94547 -8.15301 0.79246 23.35561 -19.69498 3.66063 3.71942 -3.51409 0.20534
magnitude: 3.75105 au
magnitude: 9.53441 debye
