program: Orca
programVersion: 5.0.2
elementType: S S O O O O N N N N C C C C C C C C C C C C C C H H H H H H H H H H H H H H H H H H
charge: 0
multiplicity: 1
keywords: wb97x-d3
keywords: def2-TZVPP
keywords: def2/J RIJCOSX
keywords: DEFGRID2
keywords: scfconv7
keywords: smallprint printgap noloewdin
keywords: NOSOSCF
formula: C14H18N4O4S2
InChI: InChI=1/C14H18N4O4S2/c1-3-21-13(19)17-11(23)15-9-7-5-6-8-10(9)16-12(24)18-14(20)22-4-2/h5-8,15-18H,3-4H2,1-2H3
42 atoms
S  3.525846 -2.03744 -0.000399
S  0.032247 -0.720524 2.409693
O  2.448259 2.519792 -0.699707
O  -2.749781 2.721222 0.642685
O  0.600238 1.296832 -1.072109
O  -2.966427 0.885834 -0.629942
N  1.064409 -1.339791 -0.809323
N  -1.460011 -1.168407 0.262513
N  2.635401 0.32937 -0.636638
N  -1.668942 0.905703 1.261963
C  0.399243 -2.53809 -0.518215
C  -0.88038 -2.440719 0.042519
C  0.921407 -3.792895 -0.803595
C  -1.614764 -3.583042 0.313364
C  0.184193 -4.93227 -0.514955
C  -1.081091 -4.833977 0.043011
C  2.325442 -1.012106 -0.50835
C  -1.08438 -0.341479 1.242038
C  1.783337 1.390723 -0.819494
C  -2.50987 1.465177 0.33062
C  1.718558 3.75875 -0.796432
C  -3.646717 3.463753 -0.207259
C  0.985324 4.087979 0.482113
C  -3.73535 4.863352 0.341483
H  1.894293 -3.880741 -1.262232
H  -2.602024 -3.485559 0.746386
H  0.460779 -0.558239 -1.056571
H  -2.188052 -0.859946 -0.375919
H  0.602544 -5.903673 -0.743581
H  -1.653651 -5.724697 0.264574
H  3.602521 0.547861 -0.434696
H  -1.360875 1.497037 2.022899
H  1.045066 3.730097 -1.653778
H  2.488537 4.500493 -0.999811
H  -4.625345 2.980173 -0.208915
H  -3.26281 3.466505 -1.228691
H  0.167911 3.397485 0.685571
H  1.660879 4.091798 1.33802
H  0.557648 5.087505 0.393093
H  -2.768151 5.366494 0.322274
H  -4.423186 5.440696 -0.276425
H  -4.116754 4.875106 1.362736
elementType: S O N C H
totalener: -1860.86510582 hartree
nucrepener: 2506.99063187 hartree
electener: -4367.85573769 hartree
oneelecener: -7539.07887397 hartree
twoeener: 3171.22313628 hartree
cpcmener: -0.03903729 hartree
kineticenergy: 1855.09556095 hartree
xcener: -138.425895413186 hartree
chargesum: 0.0000000
charge: -0.417295 -0.417223 -0.298087 -0.297732 -0.482081 -0.479646 -0.157467 -0.167642 -0.136315 -0.140394 0.090710 0.148061 -0.155561 -0.202598 -0.135077 -0.127550 0.208098 0.179713 0.528245 0.538155 0.046458 0.034976 -0.240161 -0.246530 0.139896 0.147053 0.191434 0.216637 0.158558 0.157550 0.179454 0.187151 0.097888 0.112869 0.109093 0.104554 0.062731 0.094444 0.098243 0.088315 0.091218 0.089857
qa: -0.4173 -0.4172 -0.2981 -0.2977 -0.4821 -0.4796 -0.1575 -0.1676 -0.1363 -0.1404 0.0907 0.1481 -0.1556 -0.2026 -0.1351 -0.1276 0.2081 0.1797 0.5282 0.5382 0.0465 0.0350 -0.2402 -0.2465 0.1399 0.1471 0.1914 0.2166 0.1586 0.1576 0.1795 0.1872 0.0979 0.1129 0.1091 0.1046 0.0627 0.0944 0.0982 0.0883 0.0912 0.0899
va: 1.9860 1.9843 2.1364 2.1288 2.0170 2.0253 3.2850 3.1854 3.2265 3.2384 3.8941 3.7122 3.9886 4.0387 3.9374 3.9021 4.3235 4.3437 4.2554 4.2326 3.8421 3.8269 3.9211 3.9757 1.0377 1.0076 1.0543 1.0179 0.9903 0.9903 1.0350 1.0278 1.0074 0.9954 0.9969 0.9961 1.0190 1.0079 1.0083 1.0019 1.0068 1.0030
dispcorr: -0.023807378 hartree
energy: -1860.888913201295
dipole: -13.29946 10.98382 -2.31564 23.96723 -20.64058 3.32665 -2.61986 1.28664 -1.33323
magnitude: 4.26688 au
magnitude: 10.84555 debye
