program: Orca
programVersion: 5.0.2
elementType: S S O O O O N N N N C C C C C C C C C C C C C C H H H H H H H H H H H H H H H H H H
charge: 0
multiplicity: 1
keywords: wb97x-d3
keywords: def2-TZVPP
keywords: def2/J RIJCOSX
keywords: DEFGRID2
keywords: scfconv7
keywords: smallprint printgap noloewdin
keywords: NOSOSCF
formula: C14H18N4O4S2
InChI: InChI=1/C14H18N4O4S2/c1-3-21-13(19)17-11(23)15-9-7-5-6-8-10(9)16-12(24)18-14(20)22-4-2/h5-8,15-18H,3-4H2,1-2H3
42 atoms
S  3.605847 -2.036764 -0.769681
S  -1.036429 -0.712054 -2.395853
O  2.58178 2.563045 -0.294765
O  -2.537365 2.920927 0.255866
O  0.810655 1.379264 0.417217
O  -2.416334 1.091226 1.557689
N  1.214537 -1.276647 0.216777
N  -1.495567 -1.056234 0.196679
N  2.74597 0.364544 -0.275203
N  -2.0643 0.997628 -0.705878
C  0.491348 -2.47082 0.207556
C  -0.906654 -2.345137 0.189653
C  1.050762 -3.742326 0.253448
C  -1.713172 -3.467227 0.215325
C  0.228632 -4.858779 0.272748
C  -1.149965 -4.732689 0.255449
C  2.438754 -0.996977 -0.246048
C  -1.550738 -0.274278 -0.894424
C  1.941419 1.43888 -0.013839
C  -2.343323 1.62872 0.47881
C  1.887065 3.795019 -0.063327
C  -2.893688 3.740862 1.374435
C  1.910987 4.207796 1.391881
C  -4.36798 3.656865 1.701626
H  2.122032 -3.858058 0.274242
H  -2.787177 -3.339189 0.186785
H  0.660144 -0.459315 0.459519
H  -1.876359 -0.689526 1.063045
H  0.682198 -5.840285 0.306956
H  -1.783422 -5.608832 0.267817
H  3.672118 0.548282 -0.632442
H  -2.039981 1.559756 -1.543462
H  0.863033 3.7219 -0.433335
H  2.41787 4.519194 -0.679204
H  -2.625412 4.749532 1.063084
H  -2.28311 3.479264 2.239425
H  1.347216 3.518707 2.018046
H  2.930597 4.272167 1.770395
H  1.457957 5.194703 1.491512
H  -4.98121 3.909729 0.837319
H  -4.648232 2.665736 2.053243
H  -4.602361 4.367459 2.494623
totalener: -1860.83344724 hartree
nucrepener: 2496.23209332 hartree
electener: -4357.06554056 hartree
oneelecener: -7517.05697462 hartree
twoeener: 3159.99143407 hartree
kineticenergy: 1855.17660333 hartree
xcener: -138.441089588241 hartree
chargesum: 0.0000000
charge: -0.342289 -0.310993 -0.293000 -0.303538 -0.454599 -0.428776 -0.151072 -0.197396 -0.152574 -0.151535 0.082290 0.142927 -0.120641 -0.159654 -0.113148 -0.105774 0.212858 0.136321 0.510011 0.511345 0.041793 0.035797 -0.260597 -0.250400 0.137649 0.117929 0.172164 0.197918 0.125893 0.123540 0.159541 0.159156 0.082753 0.107131 0.097731 0.093672 0.098567 0.092718 0.083787 0.086749 0.100538 0.085209
qa: -0.3423 -0.3110 -0.2930 -0.3035 -0.4546 -0.4288 -0.1511 -0.1974 -0.1526 -0.1515 0.0823 0.1429 -0.1206 -0.1597 -0.1131 -0.1058 0.2129 0.1363 0.5100 0.5113 0.0418 0.0358 -0.2606 -0.2504 0.1376 0.1179 0.1722 0.1979 0.1259 0.1235 0.1595 0.1592 0.0828 0.1071 0.0977 0.0937 0.0986 0.0927 0.0838 0.0867 0.1005 0.0852
va: 2.0715 2.1031 2.1319 2.1117 2.0460 2.0680 3.3054 3.1591 3.2133 3.2010 4.0315 3.7436 3.9979 4.0992 4.0065 3.9667 4.3074 4.3833 4.2517 4.2522 3.8708 3.8670 3.9116 3.9308 1.0529 1.0145 1.0747 1.0367 1.0010 1.0012 1.0545 1.0547 1.0140 0.9945 0.9930 1.0087 1.0117 1.0069 1.0092 1.0051 1.0114 1.0098
dispcorr: -0.023058808 hartree
energy: -1860.856506050693
dipole: -10.47971 9.44488 -1.03483 21.71160 -19.23271 2.47889 12.69994 -11.35306 1.34688
magnitude: 3.00497 au
magnitude: 7.63802 debye
