program: Orca
programVersion: 5.0.2
elementType: S S O O O O N N N N C C C C C C C C C C C C C C H H H H H H H H H H H H H H H H H H
charge: 0
multiplicity: 1
keywords: wb97x-d3
keywords: def2-TZVPP
keywords: def2/J RIJCOSX
keywords: DEFGRID2
keywords: scfconv7
keywords: smallprint printgap noloewdin
keywords: NOSOSCF
formula: C14H18N4O4S2
InChI: InChI=1/C14H18N4O4S2/c1-3-21-13(19)17-11(23)15-9-7-5-6-8-10(9)16-12(24)18-14(20)22-4-2/h5-8,15-18H,3-4H2,1-2H3
42 atoms
S  0.1922 -0.786234 -2.417142
S  -3.475528 -2.077428 -0.223115
O  3.157856 2.640387 -0.9569
O  -2.635017 2.568965 0.116694
O  3.271599 0.917692 0.484163
O  -0.748636 1.479689 0.674907
N  1.565472 -1.067927 -0.156072
N  -1.075996 -1.205262 0.617293
N  1.938783 0.857247 -1.378979
N  -2.692961 0.370309 0.171556
C  0.983026 -2.320789 0.148547
C  -0.356823 -2.401771 0.54626
C  1.773169 -3.457776 0.120637
C  -0.882154 -3.637258 0.903694
C  1.24306 -4.687091 0.474647
C  -0.084549 -4.769235 0.861818
C  1.271997 -0.351409 -1.252566
C  -2.332033 -0.973677 0.211027
C  2.832214 1.434314 -0.516421
C  -1.914616 1.481032 0.348602
C  4.057161 3.419087 -0.158995
C  -2.007989 3.840329 0.315206
C  3.353289 4.096454 0.996459
C  -1.9900 4.247932 1.772114
H  2.80377 -3.372389 -0.198132
H  -1.911154 -3.708785 1.217961
H  2.302627 -0.716677 0.447339
H  -0.512069 -0.372868 0.768211
H  1.86214 -5.57309 0.443132
H  -0.509165 -5.72305 1.144478
H  1.661533 1.379997 -2.19606
H  -3.64867 0.509174 -0.121736
H  4.461632 4.155676 -0.851598
H  4.881787 2.797797 0.193217
H  -2.611875 4.530988 -0.271377
H  -1.000688 3.831887 -0.103609
H  2.527145 4.716714 0.649527
H  2.970849 3.374828 1.716029
H  4.058867 4.743921 1.51785
H  -1.598838 5.26208 1.858204
H  -2.993243 4.242968 2.197387
H  -1.353531 3.595354 2.367234
totalener: -1860.83396855 hartree
nucrepener: 2484.73507262 hartree
electener: -4345.56904118 hartree
oneelecener: -7494.28112559 hartree
twoeener: 3148.71208442 hartree
kineticenergy: 1855.18123728 hartree
xcener: -138.441047437391 hartree
chargesum: -0.0000000
charge: -0.316456 -0.339277 -0.300304 -0.293800 -0.430505 -0.443383 -0.194254 -0.174476 -0.137924 -0.144519 0.142577 0.120067 -0.181426 -0.114688 -0.103527 -0.115603 0.141326 0.205030 0.502878 0.494570 0.032076 0.041748 -0.249681 -0.254067 0.120585 0.128697 0.193085 0.177383 0.124310 0.125807 0.159690 0.159395 0.102365 0.093912 0.103776 0.083370 0.080380 0.103389 0.086224 0.083486 0.089037 0.098727
qa: -0.3165 -0.3393 -0.3003 -0.2938 -0.4305 -0.4434 -0.1943 -0.1745 -0.1379 -0.1445 0.1426 0.1201 -0.1814 -0.1147 -0.1035 -0.1156 0.1413 0.2050 0.5029 0.4946 0.0321 0.0417 -0.2497 -0.2541 0.1206 0.1287 0.1931 0.1774 0.1243 0.1258 0.1597 0.1594 0.1024 0.0939 0.1038 0.0834 0.0804 0.1034 0.0862 0.0835 0.0890 0.0987
va: 2.0948 2.0728 2.1222 2.1291 2.0680 2.0452 3.1662 3.2861 3.1906 3.2095 3.7673 3.9499 4.0980 4.0308 3.9695 4.0034 4.3553 4.3137 4.2604 4.2692 3.8781 3.8780 3.9171 3.9140 1.0137 1.0452 1.0423 1.0653 1.0009 1.0008 1.0544 1.0548 0.9935 1.0101 0.9938 1.0118 1.0049 1.0117 1.0100 1.0099 1.0058 1.0118
dispcorr: -0.022266456 hartree
energy: -1860.856235008085
dipole: 9.79132 -8.35095 1.44037 22.85219 -20.38304 2.46915 11.18520 -10.20762 0.97758
magnitude: 3.02110 au
magnitude: 7.67902 debye
