program: Gaussian 09
title: 000066126
version: EM64L-G09RevD.01
frameworkgroup: C1[X(C13H21O3PS2)]
method: RPBEPBE
basis: SDD
operation: Freq
keyword: #p
keyword: freq=noraman
keyword: PBEPBE/SDD
title: #p freq=noraman PBEPBE/SDD
converged: YES YES NO NO
title: Mulliken charges:
elementType: S S P O O O C C C C C C C C C C C C C H H H H H H H H H H H H H H H H H H H H H
charge: 0.189805 -0.232227 0.871944 -0.506528 -0.469596 -0.478173 0.578491 0.596001 -0.611761 0.402106 -0.607380 -0.554438 -0.806817 -0.808970 -0.214452 -0.209904 -0.653047 -0.653119 -0.836500 0.259382 0.278293 0.251255 0.233402 0.222515 0.223504 0.232580 0.251619 0.227662 0.230436 0.230994 0.228304 0.211426 0.229861 0.237589 0.212234 0.227681 0.238660 0.261674 0.254405 0.261086
chargesum: 0.00000
title: Mulliken charges with hydrogens summed into heavy atoms:
elementType: S S P O O O C C C C C C C C C C C C C
charge: 0.189805 -0.232227 0.871944 -0.506528 -0.469596 -0.478173 0.578491 0.596001 -0.611761 0.402106 -0.347997 -0.276145 -0.099645 -0.101267 0.243646 0.249394 0.025830 0.025456 -0.059334
polarizability: 2.82599438e+02 3.05413775e+00 2.11893087e+02 9.80394116e+00 1.78039328e+00 1.66799210e+02
1716.lowfreq: -0.0016 -0.0014 0.0017 2.5388 5.8157 8.6515 16.3564 27.0084 29.3838
frequency: 15.8489 26.8346 29.2840 32.5633 36.6014 51.3662 54.3465 70.0683 78.3903 94.3617 98.1481 107.3726 126.0773 131.7235 156.8720 165.2844 194.3437 209.5702 224.1462 224.6803 238.8138 247.0397 260.0678 266.0847 284.0721 289.1229 331.8094 368.9534 380.8730 406.9427 432.5145 484.6505 511.5438 526.7046 540.8984 561.2265 580.8028 612.4031 640.4632 695.3997 705.0186 729.1387 733.9153 812.3142 813.5913 871.7577 876.0109 881.2436 891.8739 946.9476 953.7501 961.4658 983.9412 1012.5610 1015.9839 1025.7515 1033.0457 1033.4639 1046.0162 1047.1514 1104.9516 1106.4324 1134.1343 1136.1780 1143.6964 1234.7691 1256.7214 1260.0824 1296.6002 1336.8904 1355.1183 1356.9940 1357.4417 1395.8376 1396.7683 1399.4025 1401.9549 1410.9510 1420.3543 1443.2913 1455.8996 1458.0371 1458.8482 1460.1832 1462.8413 1471.6931 1477.2348 1477.5579 1478.3057 1487.6835 1488.0974 1587.0074 1595.3541 2986.2931 2987.9904 2989.0952 2989.9158 2996.5185 2996.7676 3007.5751 3056.0859 3058.0477 3067.4641 3069.7678 3090.4914 3092.3391 3092.9115 3093.0487 3110.8650 3111.0742 3127.8514 3132.3990 3152.4151 3159.7572
redmass: 3.8530 4.6268 4.0396 2.4927 3.9056 2.2925 1.9820 2.7693 5.3014 1.0880 3.8195 1.2101 2.8691 1.2110 3.1043 4.9448 4.0485 4.4196 2.2748 2.2363 1.4342 4.4898 2.6232 3.2682 3.3024 3.5441 5.4373 5.5117 7.0352 6.3171 5.6517 6.1356 5.2871 3.0469 4.4741 5.2185 5.3755 4.7025 6.9606 5.9377 7.4151 11.8805 3.2195 1.0945 1.0978 4.0203 1.3692 3.8933 1.5123 2.7829 3.1342 1.2691 1.2704 1.8374 2.3945 2.8046 4.1464 1.9920 1.5356 1.5959 2.2272 2.2074 1.4279 1.4350 1.5348 1.3932 1.1415 1.1358 6.3937 1.1359 1.2625 1.3999 4.6756 1.2442 1.2438 1.3081 1.2180 2.4824 2.5102 1.0562 1.0526 1.0400 1.0401 1.0509 1.0620 1.1768 1.0558 1.2121 1.0567 1.0794 1.0795 7.3859 6.3941 1.0370 1.0366 1.0546 1.0545 1.0384 1.0385 1.0279 1.1078 1.1075 1.0962 1.0967 1.1003 1.1001 1.0982 1.0981 1.1023 1.1023 1.1058 1.1037 1.0923 1.0924
irintensity: 0.2851 0.7309 1.2408 0.8373 0.5784 0.0904 2.0410 4.8647 0.5763 0.6675 1.4465 0.5581 1.0366 0.1177 1.5077 1.5591 1.0690 5.3879 2.9678 0.7461 0.7001 4.2072 19.2401 3.1594 1.5364 2.8776 6.0735 10.0044 2.9502 14.1651 2.8197 11.5901 1.6394 0.4762 13.7286 20.4290 31.6905 1.9225 1.5759 79.7864 141.8956 203.4375 2.3806 3.9907 3.4694 214.2377 16.7432 183.9902 34.8954 3.4255 83.6488 8.3450 23.0601 179.0347 148.8396 25.7936 2.0972 0.5446 0.0137 21.3249 12.3937 9.2618 4.1004 4.8363 68.8032 0.5928 1.0839 0.4198 85.7442 0.4173 9.5071 7.6103 0.3146 26.7355 22.6097 29.4698 5.8803 22.8972 0.0498 19.3205 17.6351 12.4757 14.0019 0.3864 13.6220 19.1207 9.8511 72.9182 14.4403 9.3425 13.4967 50.3424 75.3302 27.7494 18.8540 23.6836 24.5185 30.1522 19.4860 34.5459 11.7578 11.1485 15.3069 15.6370 21.4204 26.2476 23.3469 29.0489 33.1798 31.5225 17.2585 14.3089 0.6588 4.3625
temp: 298.150 k
press: 1.00000 atm
elementType: 16 16 15 8 8 8 6 6 6 6 6 6 6 6 6 6 6 6 6 1 1 1 1 1 1 1 1 1 1 1 1 1 1 1 1 1 1 1 1 1
symmnumber: 1
zpe: 830442.8 jmol-1
zpe.correction: 0.316299 hartree
zpe.thermalcorrener: 0.341208 hartree
zpe.thermalcorrenthalpy: 0.342152 hartree
zpe.thermalcorrgfe: 0.257331 hartree
zpe.sumelectzpe: -1869.519317 hartree
zpe.sumelectthermal: -1869.494408 hartree
zpe.sumelectthermalent: -1869.493464 hartree
zpe.sumelectthermalfe: -1869.578285 hartree
dipole: -1.6868 0.0964 0.9321
dipole: 1.9296
quadrupole: -122.7989 -118.3892 -145.7412
quadrupole: -1.0426 7.9448 0.7188
quadrupole: 6.1775 10.5872 -16.7647 -1.0426 7.9448 0.7188
hfenergy: -1869.8356158 hartree
pointgroup: C01 [X(C13H21O3P1S2)]
dipole: 0.6580452 0.018373 -0.3781072 debye
polarizability: 282.5754428|-5.8524262|212.2726191|7.6137949|-1.386594|166.4436737 unknown
InChI: InChI=1S/C13H21O3PS2/c1-6-14-17(18,15-7-2)16-12-8-10(3)13(19-5)11(4)9-12/h8-9H,6-7H2,1-5H3
charge 0 multiplicity 1
40 atoms
S  -4.992195 0.337061 0.260015
S  1.950727 -0.144247 -2.382352
P  2.208276 -0.138895 -0.336127
O  0.95739 -0.825176 0.664933
O  3.561154 -0.993498 0.29769
O  2.413077 1.381121 0.449967
C  -2.71453 -1.348219 0.429311
C  -2.256307 1.094144 0.334722
C  -3.169853 -0.000368 0.33391
C  -0.421409 -0.508521 0.501374
C  -1.321195 -1.58936 0.502483
C  -0.869082 0.824101 0.423532
C  -3.674942 -2.523726 0.450927
C  -2.726956 2.535378 0.256025
C  3.879889 -2.347048 -0.253726
C  3.442667 2.322683 -0.094636
C  5.259419 -2.7098 0.285996
C  3.206322 3.658852 0.6018
C  -5.233393 0.3309 -1.619779
H  -0.931403 -2.609735 0.566926
H  -0.14381 1.643918 0.450594
H  -4.365015 -2.458966 1.310823
H  -4.309188 -2.54749 -0.453902
H  -3.125574 -3.478517 0.512473
H  -1.871931 3.230063 0.313871
H  -3.267159 2.734219 -0.688112
H  -3.431371 2.771555 1.072753
H  3.102635 -3.052791 0.093297
H  3.863214 -2.296741 -1.359708
H  4.44164 1.908469 0.134233
H  3.316306 2.396449 -1.192297
H  5.544815 -3.717203 -0.069471
H  6.017972 -1.987841 -0.060768
H  5.257569 -2.71599 1.388894
H  3.957598 4.394645 0.259968
H  2.201684 4.050484 0.368669
H  3.296612 3.549645 1.695591
H  -4.620864 1.119639 -2.082639
H  -6.302054 0.531816 -1.795929
H  -4.961937 -0.652713 -2.03273
