program: Orca
programVersion: 5.0.2
elementType: S S O O O O N N N N C C C C C C C C C C C C C C H H H H H H H H H H H H H H H H H H
charge: 0
multiplicity: 1
keywords: wb97x-d3
keywords: def2-TZVPP
keywords: def2/J RIJCOSX
keywords: DEFGRID2
keywords: scfconv7
keywords: smallprint printgap noloewdin
keywords: NOSOSCF
formula: C14H18N4O4S2
InChI: InChI=1/C14H18N4O4S2/c1-3-21-13(19)17-11(23)15-9-7-5-6-8-10(9)16-12(24)18-14(20)22-4-2/h5-8,15-18H,3-4H2,1-2H3
42 atoms
S  0.211314 -0.762925 2.571764
S  0.100361 -0.351524 -2.46294
O  3.499995 2.168787 0.762389
O  -3.105601 2.541104 -0.461891
O  3.385859 0.326759 -0.522384
O  -3.133624 0.571586 0.623986
N  1.475106 -1.386678 0.313472
N  -1.284081 -1.15159 -0.332188
N  2.075976 0.59072 1.340053
N  -1.691706 0.982214 -1.110271
C  0.685416 -2.531052 0.087039
C  -0.655863 -2.412182 -0.2733
C  1.265495 -3.785864 0.167828
C  -1.405107 -3.551774 -0.513817
C  0.515358 -4.92357 -0.087181
C  -0.823865 -4.80688 -0.41919
C  1.288961 -0.549856 1.335648
C  -0.995942 -0.210772 -1.232598
C  3.027376 0.975767 0.429439
C  -2.694194 1.302324 -0.229751
C  4.4751 2.755576 -0.1089
C  -4.179259 3.042985 0.34376
C  3.842508 3.387218 -1.329456
C  -5.529947 2.550322 -0.126958
H  2.307377 -3.864931 0.448331
H  -2.446043 -3.447235 -0.789741
H  2.13347 -1.117032 -0.41292
H  -1.943441 -0.92187 0.406282
H  0.976624 -5.899004 -0.014002
H  -1.416804 -5.689845 -0.615145
H  1.890996 1.201136 2.12141
H  -1.432164 1.66808 -1.803044
H  5.219875 2.010796 -0.393031
H  4.967041 3.50746 0.5065
H  -4.105714 4.124764 0.241437
H  -4.011481 2.789213 1.391512
H  3.10229 4.136222 -1.049253
H  4.614541 3.886467 -1.915943
H  3.3674 2.645711 -1.969462
H  -5.692977 2.784081 -1.178806
H  -5.641918 1.477343 0.016612
H  -6.31312 3.044961 0.448278
totalener: -1860.83458458 hartree
nucrepener: 2471.50083348 hartree
electener: -4332.33541806 hartree
oneelecener: -7468.22981620 hartree
twoeener: 3135.89439815 hartree
kineticenergy: 1855.20311826 hartree
xcener: -138.439398274507 hartree
chargesum: 0.0000000
charge: -0.350925 -0.352590 -0.300867 -0.301471 -0.411842 -0.414651 -0.171900 -0.165933 -0.155400 -0.154885 0.126467 0.116055 -0.165324 -0.171979 -0.091559 -0.091981 0.174742 0.175100 0.485195 0.488325 0.033706 0.034402 -0.248919 -0.252812 0.123987 0.123640 0.208868 0.207763 0.125628 0.125843 0.160720 0.159756 0.092972 0.101119 0.100410 0.096059 0.081726 0.082886 0.105788 0.085503 0.101408 0.084971
qa: -0.3509 -0.3526 -0.3009 -0.3015 -0.4118 -0.4147 -0.1719 -0.1659 -0.1554 -0.1549 0.1265 0.1161 -0.1653 -0.1720 -0.0916 -0.0920 0.1747 0.1751 0.4852 0.4883 0.0337 0.0344 -0.2489 -0.2528 0.1240 0.1236 0.2089 0.2078 0.1256 0.1258 0.1607 0.1598 0.0930 0.1011 0.1004 0.0961 0.0817 0.0829 0.1058 0.0855 0.1014 0.0850
va: 2.0653 2.0627 2.1212 2.1210 2.0806 2.0784 3.2006 3.2006 3.1907 3.1889 3.9066 3.9170 4.0979 4.1035 3.9692 3.9716 4.3326 4.3259 4.2824 4.2779 3.8760 3.8748 3.9123 3.9114 1.0157 1.0158 1.0336 1.0329 1.0009 1.0009 1.0531 1.0539 1.0096 0.9934 0.9937 1.0088 1.0054 1.0103 1.0140 1.0050 1.0122 1.0101
dispcorr: -0.021890449 hartree
energy: -1860.856475030435
dipole: -4.59035 4.41067 -0.17969 14.07003 -12.69627 1.37376 -3.57982 3.46515 -0.11467
magnitude: 1.39020 au
magnitude: 3.53361 debye
