program: Gaussian 09
title: 000066097
version: EM64L-G09RevD.01
frameworkgroup: C1[X(C9H11NO5)]
method: RPBEPBE
basis: SDD
operation: Freq
keyword: #p
keyword: freq=noraman
keyword: PBEPBE/SDD
title: #p freq=noraman PBEPBE/SDD
converged: YES YES NO NO
title: Mulliken charges:
elementType: O O O O O N C C C C C C C C C H H H H H H H H H H H
charge: -0.279651 -0.298832 -0.485641 -0.211867 -0.228660 0.014710 0.292888 0.248538 -0.456909 0.227219 0.257997 -0.538888 -0.405967 -0.530264 -0.528369 0.329673 0.306669 0.236735 0.237710 0.262698 0.232490 0.236437 0.364351 0.248127 0.230815 0.237992
chargesum: 0.00000
title: Mulliken charges with hydrogens summed into heavy atoms:
elementType: O O O O O N C C C C C C C C C
charge: -0.279651 -0.298832 -0.121291 -0.211867 -0.228660 0.014710 0.292888 0.248538 -0.127236 0.227219 0.257997 -0.232220 0.068479 0.201361 0.188565
polarizability: 1.93487674e+02 -6.80301835e+00 1.45587508e+02 7.20267977e-01 2.12565054e+00 6.72897818e+01
1716.lowfreq: -8.9003 -3.5682 -0.0008 -0.0006 -0.0005 6.8473 42.8270 55.7686 62.0614
frequency: 42.8251 55.7665 62.0506 108.2097 125.5411 140.5673 159.8327 170.0210 185.5829 210.7457 215.4341 245.9638 257.6319 273.1612 316.2948 345.0270 387.1265 403.9902 413.8189 488.1179 511.4324 591.0068 594.8171 649.2853 700.1610 709.2108 721.3966 746.4500 791.0988 899.1254 910.6182 932.8774 954.0285 984.0970 1002.1144 1031.6085 1109.4357 1114.6762 1116.9180 1134.0068 1153.0508 1164.5963 1186.1904 1205.6251 1206.8990 1232.8882 1262.0456 1337.9534 1368.3019 1391.8436 1399.1185 1424.3989 1433.9108 1444.2812 1457.9742 1461.1028 1474.9000 1483.0654 1486.2916 1548.9937 1616.7009 2966.5423 2976.2270 2986.1774 3013.5437 3072.1291 3087.0171 3127.9543 3134.3988 3188.2021 3193.2153 3598.8724
redmass: 11.1886 4.3570 3.6919 2.7948 1.9046 1.6273 1.1120 3.5108 4.1298 4.8790 3.2921 2.6644 1.4096 4.8627 7.7546 7.0059 7.2372 7.2831 4.7068 4.3775 4.6674 7.1211 5.4436 5.4693 6.1241 8.4121 7.0530 4.2933 5.6608 7.1695 1.4051 1.4482 5.9959 8.6910 1.7326 5.1263 1.3713 1.2719 1.5815 1.8503 1.3494 2.1604 1.3918 1.1200 5.3162 1.2866 4.4328 7.2362 3.1943 5.6310 1.8327 1.1956 1.1342 1.3432 1.0615 1.0712 1.0663 3.1146 1.0524 8.8441 7.3594 1.0565 1.0305 1.0306 1.1041 1.1050 1.1040 1.1024 1.1039 1.0917 1.0914 1.0666
irintensity: 0.9696 0.4427 3.0351 8.8870 3.9517 3.1998 0.3605 3.3075 5.2036 8.0991 12.8882 52.3623 126.2288 13.7642 0.9820 2.1652 4.8919 1.8905 1.5201 11.6249 10.1780 17.0829 7.5799 10.6399 0.5565 5.0930 16.4859 14.8415 1.3718 19.8635 4.4951 46.6762 103.9190 123.4664 3.1063 88.8162 69.9473 10.7481 29.6125 7.0355 4.9014 41.7365 38.1336 26.4911 369.3942 14.4917 233.6533 69.0215 30.9794 22.6948 45.0464 19.5412 27.2751 13.6371 20.3714 8.3944 15.9423 153.9723 23.4558 52.1423 36.4911 23.6255 60.2543 73.3547 20.9964 26.7007 19.8131 21.1372 16.4419 8.7099 5.7570 15.5191
temp: 298.150 k
press: 1.00000 atm
elementType: 8 8 8 8 8 7 6 6 6 6 6 6 6 6 6 1 1 1 1 1 1 1 1 1 1 1
symmnumber: 1
zpe: 507793.7 jmol-1
zpe.correction: 0.193408 hartree
zpe.thermalcorrener: 0.208821 hartree
zpe.thermalcorrenthalpy: 0.209765 hartree
zpe.thermalcorrgfe: 0.150474 hartree
zpe.sumelectzpe: -779.160657 hartree
zpe.sumelectthermal: -779.145245 hartree
zpe.sumelectthermalent: -779.144301 hartree
zpe.sumelectthermalfe: -779.203591 hartree
dipole: -3.6430 2.8239 0.5259
dipole: 4.6393
quadrupole: -79.5126 -91.3833 -84.9402
quadrupole: 16.0622 1.6257 -5.6357
quadrupole: 5.7660 -6.1046 0.3385 16.0622 1.6257 -5.6357
hfenergy: -779.3540656 hartree
pointgroup: C01 [X(C9H11N1O5)]
dipole: 1.4856896 1.0175867 -0.2977905 debye
dipolederiv: -1.6876469 -0.4438282 -0.249509 -0.2971076 -0.4490794 -0.0966185 0.0378558 -0.0052621 -0.3790343 -1.2117375 0.3996057 0.2266209 0.4139132 -0.5583914 -0.1502906 0.11685 -0.1092051 -0.415648 -0.1325608 -0.1430865 0.0351718 0.0892652 -0.9686186 0.0798197 -0.014348 0.076499 -0.5986492 -0.5068766 -0.1021329 0.0214573 -0.2913785 -0.9866885 0.1519225 0.0586533 0.1526985 -0.2647462 -1.0107153 0.0492887 -0.0144962 0.1905265 -0.4755304 0.0564043 -0.0488299 0.0469841 -0.2375179 1.7853143 0.3697804 -0.0553681 0.4486343 1.3438052 -0.2431373 -0.0834997 -0.2242374 0.2252278 0.3755211 -0.1535891 0.0467645 0.2864073 0.1796859 -0.0305458 -0.0485679 -0.0487404 0.0011019 -0.754873 -0.4281992 0.0666207 -0.3947412 -0.2173444 0.0323107 0.0873349 0.0468423 0.014391 -0.6433838 0.0003217 -0.0640379 0.0985445 -0.0040131 -0.0446637 -0.1615813 -0.0853406 -0.121372 1.2910323 0.3809013 0.1296157 0.6698841 0.4685748 0.0538617 -0.2070584 -0.0535072 -0.0003114 0.6945033 -0.5633398 -0.0902613 -0.929804 0.1228174 0.1230479 0.2228785 0.0401486 -0.0542125 0.1593925 0.3508408 -0.0115655 -0.0712904 -0.1194123 -0.019005 0.0787091 -0.0401946 -0.1006055 0.046724 0.295681 -0.0641802 -0.0816259 0.8326567 -0.0997262 0.034762 -0.0770249 0.3760133 0.7733876 0.1919342 0.1845877 -0.136722 0.1520143 0.0468438 0.356277 0.1717441 0.4303686 0.5356332 -0.1604096 -0.1666138 -0.0184504 0.2434446 0.0914727 -0.3539159 0.2385722 0.4618453 0.1413034 -0.0565178 0.017611 -0.0469029 0.0841886 0.0077505 0.0023201 0.0083065 0.1634426 0.1335274 -0.0212107 -0.0051458 0.0281826 0.0713839 0.0119152 -0.0213663 0.0091848 0.1701222 0.0085772 -0.0501375 -0.066917 -0.0313254 -0.0774929 -0.0195828 -0.077436 -0.0369919 -0.0316724 0.0003863 -0.0273527 0.0837461 0.0091685 -0.0427393 0.0250715 0.082246 0.0410607 -0.0593507 0.0703687 0.0165491 -0.0177778 0.1168388 -0.025041 0.077016 -0.0506703 0.0161772 0.0546836 -0.0101447 0.0485987 0.0697378 0.0310621 0.0373819 -0.1002017 -0.1205999 -0.1393251 -0.1045415 -0.109097 -0.0995189 0.0134507 -0.1099619 0.0708014 0.0162839 0.0437818 0.0347882 0.0592561 0.0650044 0.1237077 -0.029747 0.041079 0.2982368 0.0234654 -0.0119173 0.0247988 0.4058948 0.0651224 -0.0242788 0.0403136 -0.1154002 -0.0493645 0.087949 0.0574572 0.0127867 0.02418 -0.0008954 -0.0800436 -0.095957 -0.0321411 0.0324322 -0.0907724 0.0491724 -0.1277962 -0.0826792 -0.077867 0.1264358 -0.0041211 0.1333453 0.0362921 0.0094089 -0.0285071 0.0270338 0.0638139 unknown
polarizability: 194.0333309|4.4972995|144.0363193|0.3217325|-9.040205|68.2953135 unknown
InChI: InChI=1S/C9H11NO5/c1-14-8-3-6(5-11)7(10(12)13)4-9(8)15-2/h3-4,11H,5H2,1-2H3
charge 0 multiplicity 1
26 atoms
O  2.535676 1.343035 -0.187464
O  2.36401 -1.554528 0.320339
O  -1.881667 3.109786 -0.594133
O  -2.480824 -2.51569 0.570414
O  -3.595748 -0.572884 0.158455
N  -2.496886 -1.250459 0.303986
C  -1.150326 0.854612 -0.136517
C  -1.213114 -0.542152 0.155661
C  0.135959 1.427295 -0.236568
C  1.313044 0.670806 -0.059105
C  1.221063 -0.738071 0.175461
C  -0.043408 -1.326772 0.299539
C  -2.364534 1.750894 -0.319968
C  3.488563 1.209942 0.94488
C  3.164123 -1.707294 -0.920413
H  0.21731 2.497449 -0.436341
H  -0.131569 -2.398011 0.495005
H  -2.990561 1.369304 -1.151613
H  -2.995024 1.723386 0.591492
H  3.668046 0.150776 1.195807
H  3.086064 1.744587 1.824551
H  4.412834 1.695967 0.599935
H  -2.658304 3.706248 -0.726733
H  3.502289 -0.725643 -1.299867
H  2.565757 -2.223029 -1.69421
H  4.026529 -2.328356 -0.636391
