program: Orca
programVersion: 5.0.2
elementType: S S O O O O N N N N C C C C C C C C C C C C C C H H H H H H H H H H H H H H H H H H
charge: 0
multiplicity: 1
keywords: wb97x-d3
keywords: def2-TZVPP
keywords: def2/J RIJCOSX
keywords: DEFGRID2
keywords: scfconv7
keywords: smallprint printgap noloewdin
keywords: NOSOSCF
formula: C14H18N4O4S2
InChI: InChI=1/C14H18N4O4S2/c1-3-21-13(19)17-11(23)15-9-7-5-6-8-10(9)16-12(24)18-14(20)22-4-2/h5-8,15-18H,3-4H2,1-2H3
42 atoms
S  -0.659203 -0.75402 -2.581979
S  0.660682 -0.753574 2.582902
O  1.871829 2.771606 -0.687649
O  -1.872748 2.770987 0.689942
O  2.69305 0.824382 0.081518
O  -2.6917 0.823614 -0.081373
N  1.182656 -1.27613 -0.736452
N  -1.180146 -1.276551 0.736644
N  1.067378 0.897364 -1.530062
N  -1.066631 0.896887 1.53084
C  0.580531 -2.507238 -0.390856
C  -0.577032 -2.507441 0.391887
C  1.1594 -3.704852 -0.764889
C  -1.154453 -3.705261 0.767469
C  0.582546 -4.906173 -0.37672
C  -0.576078 -4.90639 0.38096
C  0.594903 -0.404536 -1.564042
C  -0.593366 -0.404706 1.564653
C  1.954932 1.448524 -0.637196
C  -1.95443 1.447859 0.638114
C  2.60204 3.506198 0.304243
C  -2.603638 3.505986 -0.301114
C  1.914692 3.464995 1.652752
C  -1.916059 3.467243 -1.649568
H  2.054849 -3.69138 -1.371374
H  -2.049857 -3.69207 1.374023
H  1.928034 -0.936448 -0.133426
H  -1.925172 -0.937308 0.132942
H  1.036993 -5.84095 -0.675522
H  -1.029281 -5.841329 0.68114
H  0.557797 1.520389 -2.138609
H  -0.557767 1.5200 2.139895
H  2.634262 4.522492 -0.084969
H  3.625486 3.134854 0.370722
H  -2.637036 4.521756 0.089369
H  -3.626667 3.133602 -0.368215
H  2.439255 4.123701 2.345212
H  0.8848 3.816295 1.577329
H  1.921681 2.463275 2.082959
H  -2.440887 4.126706 -2.341109
H  -0.886377 3.818995 -1.573451
H  -1.922407 2.466171 -2.081279
totalener: -1860.82829527 hartree
nucrepener: 2610.86200910 hartree
electener: -4471.69030437 hartree
oneelecener: -7746.31906422 hartree
twoeener: 3274.62875985 hartree
kineticenergy: 1855.20245650 hartree
xcener: -138.437977196770 hartree
chargesum: 0.0000000
charge: -0.323471 -0.323502 -0.297932 -0.297956 -0.390103 -0.390096 -0.168907 -0.168873 -0.169915 -0.169955 0.115674 0.115440 -0.155453 -0.155069 -0.090459 -0.090438 0.146443 0.146396 0.462657 0.462676 0.040441 0.040445 -0.263719 -0.263582 0.123917 0.123898 0.207015 0.207048 0.126067 0.126090 0.170002 0.170064 0.101469 0.101195 0.101465 0.101166 0.094887 0.076610 0.093470 0.094879 0.076670 0.093343
qa: -0.3235 -0.3235 -0.2979 -0.2980 -0.3901 -0.3901 -0.1689 -0.1689 -0.1699 -0.1700 0.1157 0.1154 -0.1555 -0.1551 -0.0905 -0.0904 0.1464 0.1464 0.4627 0.4627 0.0404 0.0404 -0.2637 -0.2636 0.1239 0.1239 0.2070 0.2070 0.1261 0.1261 0.1700 0.1701 0.1015 0.1012 0.1015 0.1012 0.0949 0.0766 0.0935 0.0949 0.0767 0.0933
va: 2.0863 2.0863 2.1057 2.1057 2.1031 2.1031 3.1747 3.1747 3.1839 3.1839 3.9030 3.9034 4.1060 4.1058 3.9616 3.9616 4.3861 4.3860 4.2914 4.2914 3.8370 3.8371 3.8964 3.8965 1.0158 1.0158 1.0374 1.0373 1.0007 1.0007 1.0460 1.0460 0.9944 1.0086 0.9945 1.0086 1.0182 1.0097 1.0296 1.0182 1.0097 1.0295
dispcorr: -0.028095731 hartree
energy: -1860.856391001688
dipole: -0.00537 0.00512 -0.00026 17.25115 -15.55610 1.69505 0.01053 -0.00944 0.00109
magnitude: 1.69505 au
magnitude: 4.30847 debye
