program: Orca
programVersion: 5.0.2
elementType: S S O O O O N N N N C C C C C C C C C C C C C C H H H H H H H H H H H H H H H H H H
charge: 0
multiplicity: 1
keywords: wb97x-d3
keywords: def2-TZVPP
keywords: def2/J RIJCOSX
keywords: DEFGRID2
keywords: scfconv7
keywords: smallprint printgap noloewdin
keywords: NOSOSCF
formula: C14H18N4O4S2
InChI: InChI=1/C14H18N4O4S2/c1-3-21-13(19)17-11(23)15-9-7-5-6-8-10(9)16-12(24)18-14(20)22-4-2/h5-8,15-18H,3-4H2,1-2H3
42 atoms
S  2.995786 -1.514332 1.891025
S  -3.325292 -1.651521 -1.743755
O  2.840828 2.707132 -0.283447
O  -3.041176 2.585008 0.383969
O  1.203038 1.416246 -1.119953
O  -1.363205 1.290748 1.134434
N  1.251563 -1.089009 -0.093104
N  -1.445874 -1.19096 0.110924
N  2.66188 0.647283 0.474634
N  -2.944244 0.502021 -0.325735
C  0.640417 -2.357676 -0.04808
C  -0.755458 -2.409861 -0.006049
C  1.376397 -3.533383 -0.099557
C  -1.401557 -3.639226 -0.017828
C  0.726047 -4.753582 -0.109545
C  -0.660118 -4.805323 -0.070178
C  2.243582 -0.658836 0.699322
C  -2.509579 -0.79064 -0.598618
C  2.145446 1.583673 -0.38177
C  -2.354202 1.455541 0.461055
C  2.468601 3.788431 -1.146324
C  -2.53305 3.717133 1.099574
C  3.412644 4.934717 -0.8759
C  -1.411853 4.401982 0.349412
H  2.454435 -3.485205 -0.133818
H  -2.479518 -3.675986 0.020324
H  0.863133 -0.410124 -0.742637
H  -1.044245 -0.500302 0.740911
H  1.304401 -5.666349 -0.151885
H  -1.169518 -5.759317 -0.073847
H  3.429567 0.922791 1.068911
H  -3.755911 0.768451 -0.863047
H  1.434124 4.078315 -0.951027
H  2.527855 3.465952 -2.187891
H  -2.212933 3.418259 2.098476
H  -3.391696 4.378633 1.202679
H  3.15421 5.773763 -1.521108
H  3.346763 5.27439 0.157086
H  4.446484 4.660829 -1.083118
H  -1.105989 5.296057 0.893465
H  -0.542184 3.753764 0.253376
H  -1.730763 4.708231 -0.64659
totalener: -1860.83427011 hartree
nucrepener: 2444.77405833 hartree
electener: -4305.60832844 hartree
oneelecener: -7413.81716449 hartree
twoeener: 3108.20883606 hartree
kineticenergy: 1855.17597483 hartree
xcener: -138.438701594326 hartree
chargesum: -0.0000000
charge: -0.337996 -0.340084 -0.294022 -0.295650 -0.424700 -0.431009 -0.203411 -0.201490 -0.154101 -0.158999 0.116386 0.115871 -0.110440 -0.109515 -0.113705 -0.113922 0.186421 0.190368 0.488162 0.496572 0.029476 0.033764 -0.228348 -0.244990 0.125019 0.125959 0.190484 0.190067 0.124573 0.124956 0.161042 0.161335 0.083793 0.100657 0.094470 0.104660 0.082089 0.086371 0.089508 0.089162 0.077916 0.093306
qa: -0.3380 -0.3401 -0.2940 -0.2957 -0.4247 -0.4310 -0.2034 -0.2015 -0.1541 -0.1590 0.1164 0.1159 -0.1104 -0.1095 -0.1137 -0.1139 0.1864 0.1904 0.4882 0.4966 0.0295 0.0338 -0.2283 -0.2450 0.1250 0.1260 0.1905 0.1901 0.1246 0.1250 0.1610 0.1613 0.0838 0.1007 0.0945 0.1047 0.0821 0.0864 0.0895 0.0892 0.0779 0.0933
va: 2.0747 2.0718 2.1178 2.1283 2.0719 2.0632 3.2367 3.2492 3.2121 3.2122 3.8288 3.8459 4.0410 4.0315 3.9971 3.9971 4.3388 4.3337 4.2717 4.2649 3.8723 3.8965 3.9579 3.9079 1.0259 1.0313 1.0465 1.0504 1.0008 1.0007 1.0530 1.0527 0.9893 1.0012 1.0097 0.9947 1.0082 1.0052 1.0062 1.0091 1.0119 1.0040
dispcorr: -0.021519295 hartree
energy: -1860.855789403977
dipole: 5.22331 -5.00125 0.22207 25.48979 -22.81393 2.67586 -1.71229 1.61511 -0.09718
magnitude: 2.68681 au
magnitude: 6.82934 debye
