program: Orca
programVersion: 5.0.2
elementType: S S O O O O N N N N C C C C C C C C C C C C C C H H H H H H H H H H H H H H H H H H
charge: 0
multiplicity: 1
keywords: wb97x-d3
keywords: def2-TZVPP
keywords: def2/J RIJCOSX
keywords: DEFGRID2
keywords: scfconv7
keywords: smallprint printgap noloewdin
keywords: NOSOSCF
formula: C14H18N4O4S2
InChI: InChI=1/C14H18N4O4S2/c1-3-21-13(19)17-11(23)15-9-7-5-6-8-10(9)16-12(24)18-14(20)22-4-2/h5-8,15-18H,3-4H2,1-2H3
42 atoms
S  1.018343 -0.776257 2.275495
S  -3.412594 -1.948967 1.207614
O  2.682596 2.764236 -0.400472
O  -2.367145 2.598998 0.393634
O  2.484767 0.936633 -1.69194
O  -0.773908 1.333661 -0.555964
N  1.485498 -1.173253 -0.308956
N  -1.238392 -1.298069 -0.237106
N  2.115703 0.872316 0.571673
N  -2.616125 0.409078 0.449269
C  0.849866 -2.439029 -0.288116
C  -0.549496 -2.513768 -0.246468
C  1.610802 -3.591839 -0.35387
C  -1.160422 -3.760764 -0.264226
C  0.996597 -4.833798 -0.36877
C  -0.385259 -4.908845 -0.320051
C  1.557439 -0.378346 0.77129
C  -2.348785 -0.960271 0.430616
C  2.428104 1.481257 -0.616391
C  -1.820968 1.445006 0.043277
C  3.060983 3.555784 -1.531894
C  -1.663307 3.798056 0.047368
C  3.321693 4.957773 -1.038176
C  -1.875377 4.197814 -1.396323
H  2.689243 -3.507112 -0.372316
H  -2.23586 -3.831745 -0.236777
H  1.887886 -0.83392 -1.176425
H  -0.705461 -0.511443 -0.598761
H  1.594628 -5.733611 -0.411314
H  -0.876261 -5.872559 -0.331326
H  2.117194 1.440206 1.405387
H  -3.459831 0.636686 0.954228
H  2.260694 3.540659 -2.274361
H  3.952125 3.131967 -1.999223
H  -0.600983 3.686468 0.271981
H  -2.073153 4.549722 0.720097
H  3.611818 5.589653 -1.876889
H  2.433736 5.395012 -0.582812
H  4.129082 4.981664 -0.307477
H  -1.41221 5.169386 -1.571255
H  -1.425302 3.485523 -2.085329
H  -2.935375 4.290516 -1.630788
totalener: -1860.83331316 hartree
nucrepener: 2501.76901992 hartree
electener: -4362.60233307 hartree
oneelecener: -7528.16694951 hartree
twoeener: 3165.56461644 hartree
kineticenergy: 1855.18339434 hartree
xcener: -138.440658695888 hartree
chargesum: 0.0000000
charge: -0.313133 -0.337824 -0.299722 -0.292621 -0.418413 -0.454557 -0.196163 -0.162958 -0.149563 -0.150265 0.144446 0.096064 -0.162779 -0.120288 -0.104108 -0.112510 0.138897 0.209332 0.501788 0.508002 0.021182 0.046810 -0.227615 -0.259600 0.119251 0.132094 0.196333 0.172136 0.123625 0.125557 0.158656 0.159857 0.097916 0.101233 0.075033 0.107080 0.082964 0.079690 0.088867 0.083291 0.100349 0.091664
qa: -0.3131 -0.3378 -0.2997 -0.2926 -0.4184 -0.4546 -0.1962 -0.1630 -0.1496 -0.1503 0.1444 0.0961 -0.1628 -0.1203 -0.1041 -0.1125 0.1389 0.2093 0.5018 0.5080 0.0212 0.0468 -0.2276 -0.2596 0.1193 0.1321 0.1963 0.1721 0.1236 0.1256 0.1587 0.1599 0.0979 0.1012 0.0750 0.1071 0.0830 0.0797 0.0889 0.0833 0.1003 0.0917
va: 2.0978 2.0760 2.1028 2.1316 2.0840 2.0388 3.1600 3.2928 3.1903 3.2139 3.7516 3.9885 4.0940 4.0248 3.9674 4.0032 4.3783 4.3127 4.2608 4.2516 3.8598 3.8754 3.9614 3.9098 1.0140 1.0481 1.0367 1.0737 1.0011 1.0008 1.0548 1.0540 0.9970 1.0015 1.0169 0.9945 1.0088 1.0043 1.0050 1.0093 1.0119 1.0071
dispcorr: -0.023180571 hartree
energy: -1860.856493727838
dipole: 8.06542 -7.04812 1.01730 24.37135 -21.90478 2.46656 -11.87052 10.45516 -1.41536
magnitude: 3.02028 au
magnitude: 7.67693 debye
