program: Orca
programVersion: 5.0.2
elementType: S S O O O O N N N N C C C C C C C C C C C C C C H H H H H H H H H H H H H H H H H H
charge: 0
multiplicity: 1
keywords: wb97x-d3
keywords: def2-TZVPP
keywords: def2/J RIJCOSX
keywords: DEFGRID2
keywords: scfconv7
keywords: smallprint printgap noloewdin
keywords: NOSOSCF
formula: C14H18N4O4S2
InChI: InChI=1/C14H18N4O4S2/c1-3-21-13(19)17-11(23)15-9-7-5-6-8-10(9)16-12(24)18-14(20)22-4-2/h5-8,15-18H,3-4H2,1-2H3
42 atoms
S  1.810824 -1.423215 -3.015621
S  -2.133501 -1.610476 3.0079
O  2.353403 2.777625 -0.844372
O  -2.806352 2.60666 0.914062
O  1.577521 1.290763 0.647526
O  -1.681801 1.272255 -0.502394
N  1.210143 -1.141266 -0.426242
N  -1.3185 -1.201303 0.491843
N  2.078953 0.694227 -1.510322
N  -2.389625 0.539373 1.551975
C  0.610762 -2.404182 -0.253984
C  -0.672054 -2.435832 0.297648
C  1.268734 -3.587151 -0.556155
C  -1.280655 -3.654133 0.565499
C  0.653212 -4.797978 -0.294533
C  -0.614115 -4.830154 0.271048
C  1.680272 -0.635639 -1.574059
C  -1.915431 -0.767396 1.608971
C  1.964197 1.570618 -0.463209
C  -2.237704 1.465543 0.554568
C  2.3814 3.802517 0.157387
C  -2.804786 3.679979 -0.034393
C  2.674314 5.110747 -0.534051
C  -1.486864 4.421396 -0.074756
H  2.257576 -3.550433 -0.988791
H  -2.27096 -3.674406 0.994931
H  1.173371 -0.504953 0.366516
H  -1.232956 -0.524112 -0.262046
H  1.167983 -5.720079 -0.527451
H  -1.092094 -5.778112 0.47728
H  2.423041 1.049347 -2.389971
H  -2.860346 0.828065 2.396546
H  3.149339 3.56494 0.896748
H  1.424205 3.841066 0.679403
H  -3.604451 4.335707 0.306256
H  -3.072371 3.306216 -1.02401
H  1.89697 5.364349 -1.25426
H  2.715307 5.90826 0.207203
H  3.631465 5.088601 -1.053201
H  -1.593924 5.306342 -0.702415
H  -1.189348 4.753725 0.919539
H  -0.692768 3.809001 -0.497618
totalener: -1860.83376110 hartree
nucrepener: 2465.39785999 hartree
electener: -4326.23162109 hartree
oneelecener: -7455.01072347 hartree
twoeener: 3128.77910238 hartree
kineticenergy: 1855.18645778 hartree
xcener: -138.439882135136 hartree
chargesum: -0.0000000
charge: -0.336206 -0.338619 -0.295808 -0.295532 -0.421452 -0.435631 -0.204283 -0.197465 -0.153652 -0.154753 0.114136 0.107982 -0.111888 -0.110251 -0.110086 -0.112631 0.182667 0.186782 0.488740 0.496545 0.001405 0.039571 -0.225092 -0.269034 0.126530 0.126988 0.192810 0.190390 0.125380 0.125621 0.160633 0.161087 0.114680 0.092770 0.105308 0.095521 0.083734 0.083004 0.092959 0.093416 0.091653 0.092070
qa: -0.3362 -0.3386 -0.2958 -0.2955 -0.4215 -0.4356 -0.2043 -0.1975 -0.1537 -0.1548 0.1141 0.1080 -0.1119 -0.1103 -0.1101 -0.1126 0.1827 0.1868 0.4887 0.4965 0.0014 0.0396 -0.2251 -0.2690 0.1265 0.1270 0.1928 0.1904 0.1254 0.1256 0.1606 0.1611 0.1147 0.0928 0.1053 0.0955 0.0837 0.0830 0.0930 0.0934 0.0917 0.0921
va: 2.0801 2.0756 2.1024 2.1260 2.0726 2.0570 3.2286 3.2469 3.2148 3.2146 3.8284 3.8512 4.0505 4.0454 3.9879 3.9926 4.3471 4.3407 4.2668 4.2612 3.8616 3.8881 3.9466 3.9117 1.0239 1.0278 1.0479 1.0484 1.0006 1.0006 1.0527 1.0529 1.0028 0.9964 0.9944 1.0083 1.0052 1.0083 1.0058 1.0106 1.0019 1.0068
dispcorr: -0.022536963 hartree
energy: -1860.856298064803
dipole: 3.01416 -2.99612 0.01804 25.67101 -23.01896 2.65205 -1.32763 1.29786 -0.02977
magnitude: 2.65227 au
magnitude: 6.74155 debye
