program: Gaussian 09
title: 000066118
version: EM64L-G09RevD.01
frameworkgroup: C1[X(C13H25NS)]
method: RPBEPBE
basis: SDD
operation: Freq
keyword: #p
keyword: freq=noraman
keyword: PBEPBE/SDD
title: #p freq=noraman PBEPBE/SDD
converged: YES YES NO NO
title: Mulliken charges:
elementType: S N C C C C C C C C C C C C C H H H H H H H H H H H H H H H H H H H H H H H H H
charge: 0.098067 0.247902 -0.384812 -0.385140 -0.385719 -0.381729 -0.373755 -0.373059 -0.366639 -0.353164 -0.376162 -0.356787 -0.412896 -0.696495 -0.531502 0.194892 0.192528 0.193073 0.195109 0.198586 0.193375 0.192538 0.191359 0.197037 0.190092 0.190305 0.189290 0.191761 0.217624 0.187920 0.187194 0.208623 0.222195 0.195280 0.194644 0.232180 0.241881 0.209366 0.215250 0.209789
chargesum: 0.00000
title: Mulliken charges with hydrogens summed into heavy atoms:
elementType: S N C C C C C C C C C C C C C
charge: 0.098067 0.247902 0.002608 0.003043 0.006242 0.002168 0.013374 0.006536 0.042745 0.021950 0.054655 0.033137 0.061165 -0.062090 -0.531502
polarizability: 1.95283585e+02 1.66259958e+01 1.78773624e+02 -1.06095382e+00 -3.16159209e+00 1.21351146e+02
1716.lowfreq: 0.0021 0.0024 0.0025 2.5257 5.6201 7.0646 10.9506 20.4476 30.4705
frequency: 10.9462 20.3356 29.7935 34.0486 45.3315 53.0814 74.3343 83.7404 94.9905 111.6185 126.9656 138.7257 149.4896 160.9462 172.6037 188.3366 232.2933 258.4991 292.5709 369.4376 376.8161 392.7403 399.2047 461.2464 478.8563 512.1597 609.7143 720.8349 722.5151 728.0909 742.3243 769.6060 809.9438 850.7616 871.7250 887.8220 915.5252 954.1165 984.7141 986.5632 1003.4028 1025.3585 1029.0305 1048.0868 1061.8479 1078.0511 1080.1324 1081.4572 1090.2335 1109.3282 1124.4785 1145.2498 1183.0613 1200.7397 1206.9386 1227.8493 1235.6112 1251.5950 1262.3058 1274.6845 1278.6543 1283.1204 1288.0655 1293.9566 1298.1818 1299.4344 1302.3629 1322.8078 1336.4313 1343.1617 1352.4970 1355.1194 1357.0939 1363.7158 1388.3483 1456.1107 1459.1795 1459.6497 1462.8746 1463.0665 1466.1534 1466.7400 1471.7397 1476.8154 1477.5877 1482.3445 1486.4151 1488.5574 2213.7082 2948.8558 2949.1836 2950.6645 2951.9277 2953.6917 2958.0314 2962.3566 2964.5995 2966.5133 2968.3093 2971.4271 2981.6902 2982.5336 2986.0168 2991.0733 2997.7540 3007.4490 3014.4690 3018.0220 3026.2733 3035.0193 3042.5804 3054.5816 3068.1908 3070.5266
redmass: 11.9248 4.6007 1.9304 4.3574 2.5663 2.7403 1.9837 3.5007 2.6173 1.8030 3.2487 2.1090 2.2307 2.0408 3.5511 2.6025 1.1159 2.7712 3.4635 3.2541 4.1098 11.9981 7.2301 2.9509 3.2182 2.8776 3.8654 1.0580 1.0671 1.0885 1.1344 1.2023 1.2655 1.4750 1.5230 1.9026 1.4536 1.6726 4.1077 1.6003 2.5845 2.3010 1.3615 2.9011 2.9197 2.3016 2.2255 2.2342 2.4922 3.4642 3.0264 1.9587 1.8439 1.2532 1.5352 1.2786 1.3749 1.2577 1.2863 1.2457 1.0175 1.1767 1.0674 1.1199 1.1469 1.1714 1.1488 1.3345 1.2911 1.4173 1.6759 1.5932 1.6410 1.5453 1.2175 1.0794 1.0737 1.0732 1.0745 1.0620 1.0782 1.0799 1.0838 1.0624 1.0658 1.0895 1.0934 1.0940 12.2221 1.0586 1.0586 1.0591 1.0591 1.0595 1.0595 1.0595 1.0576 1.0600 1.0586 1.0365 1.0636 1.0951 1.0968 1.0982 1.1004 1.1021 1.1018 1.1029 1.1040 1.1047 1.1046 1.1040 1.1007 1.0993
irintensity: 0.5073 0.1230 0.0332 0.1425 1.1375 0.6467 0.7960 0.5723 0.2906 0.6879 0.8021 0.2538 0.1279 0.0089 0.2328 2.5653 0.0005 0.5188 1.0207 0.3504 0.6612 0.1938 1.9624 2.9937 0.8554 3.2924 14.5256 19.1383 0.1500 7.6238 0.6183 5.6816 0.9387 2.1826 2.9714 4.7752 1.7572 2.8379 0.1777 1.0569 0.6961 0.0352 0.0761 0.4731 0.5271 0.2690 0.4778 0.4998 8.2689 2.8044 8.6767 0.8652 0.0586 20.1157 0.8988 0.5850 0.3386 0.4778 0.4938 0.2970 0.1432 0.0433 0.6483 0.0972 0.1686 0.1886 0.1135 0.1602 30.8602 7.4364 0.8998 2.6727 0.3057 16.1565 11.1606 2.3620 0.0016 0.2347 0.0138 0.1925 22.5721 7.7725 0.6363 7.8364 6.7092 1.8666 4.6103 38.5036 876.6701 0.0087 0.2525 0.0204 1.2737 3.1215 0.6909 23.8090 51.2134 42.7368 226.5136 36.5525 53.2874 3.9609 1.7156 1.7122 0.7750 0.2660 18.8301 12.3075 3.3996 4.1162 184.5794 146.8662 99.5143 55.3936
temp: 298.150 k
press: 1.00000 atm
elementType: 16 7 6 6 6 6 6 6 6 6 6 6 6 6 6 1 1 1 1 1 1 1 1 1 1 1 1 1 1 1 1 1 1 1 1 1 1 1 1 1
symmnumber: 1
zpe: 930446.1 jmol-1
zpe.correction: 0.354388 hartree
zpe.thermalcorrener: 0.374454 hartree
zpe.thermalcorrenthalpy: 0.375398 hartree
zpe.thermalcorrgfe: 0.299945 hartree
zpe.sumelectzpe: -961.966832 hartree
zpe.sumelectthermal: -961.946766 hartree
zpe.sumelectthermalent: -961.945822 hartree
zpe.sumelectthermalfe: -962.021275 hartree
dipole: -1.9566 -4.0825 0.3805
dipole: 4.5431
quadrupole: -124.0431 -104.0140 -102.6491
quadrupole: -23.8980 1.5878 -1.1833
quadrupole: -13.8077 6.2214 7.5863 -23.8980 1.5878 -1.1833
hfenergy: -962.3212201 hartree
pointgroup: C01 [X(C13H25N1S1)]
dipole: -0.6950866 -1.4764008 0.7292879 debye
polarizability: 193.7194904|15.2586222|170.66375|-8.3397848|-22.0361699|131.0251144 unknown
InChI: InChI=1S/C13H25NS/c1-2-3-4-5-6-7-8-9-10-11-12-14-13-15/h2-12H2,1H3
charge 0 multiplicity 1
40 atoms
S  6.552934 2.646866 -1.403506
N  5.801157 0.223478 -0.124093
C  -1.040033 -0.745146 -0.101107
C  -2.218234 0.174768 0.290708
C  0.333997 -0.211807 0.363082
C  -3.591759 -0.35809 -0.175786
C  1.509828 -1.135882 -0.026162
C  -4.771387 0.560153 0.216222
C  2.88378 -0.596265 0.431063
C  -6.144752 0.026553 -0.250125
C  4.049601 -1.530897 0.04416
C  -7.324725 0.945458 0.141038
C  5.439677 -1.015057 0.496283
C  -8.69279 0.403269 -0.326786
C  6.121729 1.248724 -0.668381
H  -1.02868 -0.875322 -1.203625
H  -1.206005 -1.755268 0.329034
H  -2.231133 0.304535 1.393326
H  -2.052467 1.185112 -0.138465
H  0.501498 0.796015 -0.070623
H  0.321691 -0.07763 1.465068
H  -3.579148 -0.486803 -1.278522
H  -3.75721 -1.369119 0.252388
H  1.518462 -1.27196 -1.127795
H  1.343838 -2.143083 0.410831
H  -4.606659 1.571021 -0.212451
H  -4.78429 0.689501 1.318959
H  2.87565 -0.453878 1.532035
H  3.050674 0.404904 -0.013953
H  -6.133342 -0.103189 -1.352813
H  -6.311464 -0.983909 0.178997
H  3.904653 -2.526263 0.510321
H  4.062388 -1.686573 -1.052031
H  -7.158332 1.954155 -0.289406
H  -7.334419 1.076103 1.242584
H  5.442557 -0.875049 1.596515
H  6.215761 -1.770367 0.259851
H  -8.896543 -0.590795 0.114607
H  -9.518687 1.07813 -0.035331
H  -8.719416 0.292009 -1.42741
