program: Orca
programVersion: 5.0.2
elementType: S S O O O O N N N N C C C C C C C C C C C C C C H H H H H H H H H H H H H H H H H H
charge: 0
multiplicity: 1
keywords: wb97x-d3
keywords: def2-TZVPP
keywords: def2/J RIJCOSX
keywords: DEFGRID2
keywords: scfconv7
keywords: smallprint printgap noloewdin
keywords: NOSOSCF
formula: C14H18N4O4S2
InChI: InChI=1/C14H18N4O4S2/c1-3-21-13(19)17-11(23)15-9-7-5-6-8-10(9)16-12(24)18-14(20)22-4-2/h5-8,15-18H,3-4H2,1-2H3
42 atoms
S  3.642755 -2.103606 -0.538671
S  0.182354 -0.370923 2.205988
O  2.601451 2.490173 -0.79051
O  -2.958645 2.760181 0.489097
O  0.680865 1.341556 -1.00382
O  -3.184387 0.828941 -0.635076
N  1.088755 -1.326725 -0.888038
N  -1.4264 -1.047475 0.197952
N  2.719932 0.294775 -0.925344
N  -1.717661 1.052454 1.114363
C  0.411933 -2.492639 -0.522935
C  -0.858786 -2.336417 0.046854
C  0.902263 -3.776433 -0.731356
C  -1.609352 -3.445192 0.397981
C  0.143426 -4.877386 -0.367904
C  -1.111114 -4.721587 0.196984
C  2.397234 -1.053902 -0.791802
C  -1.034098 -0.152119 1.115609
C  1.886724 1.380686 -0.907665
C  -2.670564 1.493381 0.232992
C  1.88838 3.711255 -0.56672
C  -3.984314 3.371946 -0.302849
C  1.493828 3.861024 0.887071
C  -4.131562 4.798128 0.168129
H  1.872663 -3.911908 -1.180359
H  -2.582961 -3.296902 0.846055
H  0.493089 -0.511274 -1.007235
H  -2.220517 -0.800988 -0.385068
H  0.542483 -5.868131 -0.538678
H  -1.698453 -5.583845 0.480996
H  3.710706 0.466422 -0.836853
H  -1.374476 1.70351 1.803875
H  1.018322 3.767252 -1.221965
H  2.585928 4.493304 -0.862488
H  -4.918936 2.819955 -0.184219
H  -3.708967 3.330804 -1.35823
H  0.818204 3.067848 1.205516
H  2.36664 3.845789 1.538678
H  0.985016 4.814572 1.030151
H  -3.207661 5.36075 0.038653
H  -4.907527 5.292588 -0.415275
H  -4.42069 4.847296 1.217257
totalener: -1860.83377620 hartree
nucrepener: 2495.07771397 hartree
electener: -4355.91149016 hartree
oneelecener: -7514.82250956 hartree
twoeener: 3158.91101940 hartree
kineticenergy: 1855.18263997 hartree
xcener: -138.440837815625 hartree
chargesum: -0.0000000
charge: -0.341915 -0.318431 -0.293240 -0.296749 -0.438673 -0.419867 -0.170991 -0.191506 -0.151486 -0.144659 0.107268 0.146386 -0.115025 -0.178568 -0.115017 -0.105266 0.213686 0.138450 0.494382 0.498376 0.030084 0.028247 -0.223395 -0.228860 0.133512 0.119911 0.176492 0.193914 0.126427 0.124493 0.159561 0.163943 0.091098 0.102545 0.094913 0.097215 0.065025 0.093290 0.080906 0.083463 0.082833 0.087230
qa: -0.3419 -0.3184 -0.2932 -0.2967 -0.4387 -0.4199 -0.1710 -0.1915 -0.1515 -0.1447 0.1073 0.1464 -0.1150 -0.1786 -0.1150 -0.1053 0.2137 0.1384 0.4944 0.4984 0.0301 0.0282 -0.2234 -0.2289 0.1335 0.1199 0.1765 0.1939 0.1264 0.1245 0.1596 0.1639 0.0911 0.1025 0.0949 0.0972 0.0650 0.0933 0.0809 0.0835 0.0828 0.0872
va: 2.0696 2.0922 2.1286 2.1143 2.0537 2.0843 3.2985 3.1690 3.2051 3.1896 3.9842 3.7515 4.0073 4.1016 4.0029 3.9700 4.3095 4.3665 4.2792 4.2650 3.8790 3.8640 3.9172 3.9604 1.0506 1.0137 1.0672 1.0412 1.0008 1.0009 1.0542 1.0490 1.0110 0.9952 0.9991 0.9980 1.0285 1.0092 1.0111 1.0047 1.0087 1.0046
dispcorr: -0.023051925 hartree
energy: -1860.856828120779
dipole: -13.70968 12.00127 -1.70841 22.62499 -20.29606 2.32893 -0.00187 -0.51929 -0.52115
magnitude: 2.93499 au
magnitude: 7.46016 debye
