program: Orca
programVersion: 5.0.2
elementType: S S O O O O N N N N C C C C C C C C C C C C H H H H H H H H H H H H H H
charge: 0
multiplicity: 1
keywords: wb97x-d3
keywords: def2-TZVPP
keywords: def2/J RIJCOSX
keywords: DEFGRID2
keywords: scfconv7
keywords: smallprint printgap noloewdin
keywords: NOSOSCF
formula: C12H14N4O4S2
InChI: InChI=1/C12H14N4O4S2/c1-19-11(17)15-9(21)13-7-5-3-4-6-8(7)14-10(22)16-12(18)20-2/h3-6,13-16H,1-2H3
36 atoms
S  3.105942 -1.551041 -1.525225
S  -0.748575 0.037377 -2.155781
O  2.696151 2.879869 0.10883
O  -3.386662 2.938083 0.558247
O  1.019933 1.653351 0.959964
O  -2.980092 1.048319 1.700828
N  1.244821 -0.958352 0.312887
N  -1.522363 -0.724068 0.268802
N  2.686577 0.720461 -0.317255
N  -2.187415 1.377036 -0.428881
C  0.479777 -2.125807 0.18535
C  -0.912415 -1.995249 0.155152
C  1.044796 -3.394448 0.153331
C  -1.716331 -3.123793 0.097725
C  0.234104 -4.516834 0.077807
C  -1.146349 -4.38628 0.050825
C  2.273095 -0.591005 -0.459965
C  -1.506013 0.207422 -0.688592
C  2.040891 1.755087 0.310966
C  -2.867851 1.735672 0.70825
C  2.162154 4.064233 0.709208
C  -4.149985 3.46253 1.650138
H  2.117148 -3.504956 0.204511
H  -2.791941 -3.005641 0.080834
H  0.805051 -0.205705 0.838065
H  -2.09122 -0.550543 1.092759
H  0.688559 -5.498167 0.055887
H  -1.779325 -5.261465 -0.002341
H  3.507049 0.956808 -0.860194
H  -2.163583 2.049324 -1.184507
H  2.132075 3.97759 1.79451
H  2.841281 4.864108 0.431031
H  1.166776 4.286187 0.32723
H  -4.539531 4.415153 1.302711
H  -4.980511 2.805001 1.906507
H  -3.521705 3.625437 2.525808
elementType: S O N C H
totalener: -1782.21185440 hartree
nucrepener: 2177.73735032 hartree
electener: -3959.94920473 hartree
oneelecener: -6777.35495958 hartree
twoeener: 2817.40575485 hartree
cpcmener: -0.04569844 hartree
kineticenergy: 1776.85856434 hartree
xcener: -130.069816044791 hartree
chargesum: 0.0000000
charge: -0.426527 -0.429479 -0.293354 -0.297635 -0.495882 -0.497864 -0.163877 -0.153571 -0.130885 -0.131226 0.125181 0.125270 -0.162522 -0.213061 -0.138526 -0.129489 0.210559 0.184503 0.544454 0.556875 -0.117965 -0.118952 0.140984 0.150281 0.198659 0.214851 0.161383 0.161871 0.183196 0.186661 0.122581 0.132565 0.122813 0.131514 0.120790 0.125826
qa: -0.4265 -0.4295 -0.2934 -0.2976 -0.4959 -0.4979 -0.1639 -0.1536 -0.1309 -0.1312 0.1252 0.1253 -0.1625 -0.2131 -0.1385 -0.1295 0.2106 0.1845 0.5445 0.5569 -0.1180 -0.1190 0.1410 0.1503 0.1987 0.2149 0.1614 0.1619 0.1832 0.1867 0.1226 0.1326 0.1228 0.1315 0.1208 0.1258
va: 1.9757 1.9707 2.1272 2.1243 1.9988 2.0040 3.2854 3.1984 3.2300 3.2371 3.8357 3.7485 3.9860 4.0295 3.9319 3.8948 4.3179 4.3184 4.2274 4.2154 3.8452 3.8460 1.0343 1.0065 1.0439 1.0187 0.9895 0.9886 1.0314 1.0287 0.9927 0.9944 0.9925 0.9945 0.9932 0.9911
dispcorr: -0.018988295 hartree
energy: -1782.230842699692
dipole: -7.36835 5.58284 -1.78552 8.74018 -5.95933 2.78085 9.02750 -6.59328 2.43423
magnitude: 4.10447 au
magnitude: 10.43272 debye
