program: Orca
programVersion: 5.0.2
elementType: S S O O O O N N N N C C C C C C C C C C C C H H H H H H H H H H H H H H
charge: 0
multiplicity: 1
keywords: wb97x-d3
keywords: def2-TZVPP
keywords: def2/J RIJCOSX
keywords: DEFGRID2
keywords: scfconv7
keywords: smallprint printgap noloewdin
keywords: NOSOSCF
formula: C12H14N4O4S2
InChI: InChI=1/C12H14N4O4S2/c1-19-11(17)15-9(21)13-7-5-3-4-6-8(7)14-10(22)16-12(18)20-2/h3-6,13-16H,1-2H3
36 atoms
S  2.574939 -0.966754 1.969998
S  -2.589241 -0.987611 -1.951605
O  2.117801 3.186464 -0.286138
O  -2.085172 3.184483 0.252971
O  0.964525 1.618533 -1.402594
O  -0.9104 1.629187 1.364967
N  1.332295 -0.85804 -0.374087
N  -1.295076 -0.859416 0.364402
N  2.326836 1.091789 0.369543
N  -2.308112 1.083088 -0.373838
C  0.695577 -2.105756 -0.170908
C  -0.658576 -2.10638 0.157747
C  1.372905 -3.303457 -0.335149
C  -1.336688 -3.305014 0.312015
C  0.693441 -4.501139 -0.177797
C  -0.658302 -4.501755 0.143182
C  2.031153 -0.238952 0.58214
C  -2.01675 -0.24947 -0.580954
C  1.730519 1.94975 -0.522403
C  -1.69208 1.95085 0.495194
C  1.613546 4.204466 -1.158116
C  -1.559598 4.214994 1.096817
H  2.42339 -3.29398 -0.591661
H  -2.387292 -3.297307 0.567819
H  0.981733 -0.28636 -1.13865
H  -0.93191 -0.280613 1.117361
H  1.220018 -5.436949 -0.308049
H  -1.186194 -5.438084 0.263985
H  2.911723 1.50648 1.083825
H  -2.910136 1.49022 -1.078084
H  1.986988 4.06776 -2.172335
H  0.524627 4.222504 -1.164972
H  1.987199 5.142145 -0.759133
H  -0.471305 4.24121 1.065367
H  -1.954087 5.145482 0.701007
H  -1.896122 4.08709 2.124939
elementType: S O N C H
totalener: -1782.21199382 hartree
nucrepener: 2222.90672543 hartree
electener: -4005.11871926 hartree
oneelecener: -6866.75472919 hartree
twoeener: 2861.63600994 hartree
cpcmener: -0.04541873 hartree
kineticenergy: 1776.86252105 hartree
xcener: -130.063374848181 hartree
chargesum: -0.0000000
charge: -0.427977 -0.428357 -0.295181 -0.295210 -0.493537 -0.493178 -0.158262 -0.158635 -0.135673 -0.135975 0.105772 0.101969 -0.171132 -0.170179 -0.120478 -0.120750 0.188457 0.190484 0.538758 0.539608 -0.127711 -0.126538 0.149705 0.149930 0.208726 0.206982 0.162264 0.162172 0.186435 0.186182 0.137176 0.117590 0.136608 0.117552 0.136255 0.136153
qa: -0.4280 -0.4284 -0.2952 -0.2952 -0.4935 -0.4932 -0.1583 -0.1586 -0.1357 -0.1360 0.1058 0.1020 -0.1711 -0.1702 -0.1205 -0.1208 0.1885 0.1905 0.5388 0.5396 -0.1277 -0.1265 0.1497 0.1499 0.2087 0.2070 0.1623 0.1622 0.1864 0.1862 0.1372 0.1176 0.1366 0.1176 0.1363 0.1362
va: 1.9733 1.9733 2.1133 2.1137 2.0029 2.0040 3.2428 3.2472 3.2500 3.2503 3.7783 3.7865 4.0262 4.0224 3.8987 3.8996 4.3486 4.3482 4.2421 4.2411 3.8343 3.8356 1.0094 1.0097 1.0282 1.0295 0.9884 0.9884 1.0285 1.0287 0.9949 0.9882 0.9924 0.9875 0.9927 0.9950
dispcorr: -0.022047520 hartree
energy: -1782.234041342868
dipole: 0.10547 -0.07688 0.02859 10.81397 -7.57298 3.24099 -0.15979 0.12156 -0.03823
magnitude: 3.24134 au
magnitude: 8.23884 debye
