program: Orca
programVersion: 5.0.2
elementType: S S O O O O N N N N C C C C C C C C C C C C H H H H H H H H H H H H H H
charge: 0
multiplicity: 1
keywords: wb97x-d3
keywords: def2-TZVPP
keywords: def2/J RIJCOSX
keywords: DEFGRID2
keywords: scfconv7
keywords: smallprint printgap noloewdin
keywords: NOSOSCF
formula: C12H14N4O4S2
InChI: InChI=1/C12H14N4O4S2/c1-19-11(17)15-9(21)13-7-5-3-4-6-8(7)14-10(22)16-12(18)20-2/h3-6,13-16H,1-2H3
36 atoms
S  2.021962 -1.086463 -2.864755
S  -1.805432 -1.059025 2.912779
O  2.256996 3.145853 -0.701948
O  -2.16086 3.164825 0.753905
O  1.332816 1.66803 0.706995
O  -1.569162 1.628205 -0.767821
N  1.278026 -0.817701 -0.316534
N  -1.349777 -0.830573 0.298333
N  2.156956 1.042068 -1.344686
N  -2.081847 1.05844 1.396156
C  0.641955 -2.070745 -0.209501
C  -0.699219 -2.077584 0.177232
C  1.313845 -3.268338 -0.409005
C  -1.360151 -3.279534 0.380228
C  0.646871 -4.466382 -0.212753
C  -0.683901 -4.472852 0.186705
C  1.79289 -0.288122 -1.428643
C  -1.731929 -0.275969 1.451942
C  1.867161 1.940179 -0.34684
C  -1.906833 1.936297 0.354176
C  2.047763 4.202899 0.238446
C  -2.082094 4.201013 -0.228158
H  2.354932 -3.259188 -0.699273
H  -2.400476 -3.276105 0.674491
H  1.15459 -0.184752 0.470888
H  -1.31563 -0.21931 -0.51472
H  1.172256 -5.400181 -0.363714
H  -1.199047 -5.411368 0.343109
H  2.586746 1.409317 -2.184086
H  -2.386406 1.446073 2.279736
H  0.989259 4.335581 0.462114
H  2.597675 4.025562 1.162193
H  2.429698 5.099627 -0.240795
H  -2.198803 5.132144 0.317432
H  -1.122199 4.201852 -0.742296
H  -2.886253 4.10739 -0.957088
elementType: S O N C H
totalener: -1782.21747281 hartree
nucrepener: 2192.08693459 hartree
electener: -3974.30440740 hartree
oneelecener: -6804.84281589 hartree
twoeener: 2830.53840848 hartree
cpcmener: -0.03830637 hartree
kineticenergy: 1776.87770298 hartree
xcener: -130.068833505417 hartree
chargesum: 0.0000000
charge: -0.422071 -0.421038 -0.292336 -0.292428 -0.479109 -0.476149 -0.174009 -0.179228 -0.141064 -0.137032 0.106551 0.116833 -0.159110 -0.164064 -0.128412 -0.126369 0.204180 0.199595 0.534292 0.526334 -0.115269 -0.122578 0.145202 0.146397 0.205399 0.210009 0.157924 0.157746 0.182030 0.182241 0.113581 0.127275 0.132679 0.133487 0.112192 0.136319
qa: -0.4221 -0.4210 -0.2923 -0.2924 -0.4791 -0.4761 -0.1740 -0.1792 -0.1411 -0.1370 0.1066 0.1168 -0.1591 -0.1641 -0.1284 -0.1264 0.2042 0.1996 0.5343 0.5263 -0.1153 -0.1226 0.1452 0.1464 0.2054 0.2100 0.1579 0.1577 0.1820 0.1822 0.1136 0.1273 0.1327 0.1335 0.1122 0.1363
va: 1.9829 1.9845 2.1219 2.1156 2.0238 2.0241 3.2584 3.2396 3.2458 3.2448 3.7830 3.7598 4.0087 4.0157 3.9276 3.9213 4.3421 4.3442 4.2403 4.2547 3.8524 3.8443 1.0191 1.0148 1.0321 1.0290 0.9901 0.9900 1.0321 1.0320 0.9826 0.9951 0.9940 0.9929 0.9879 0.9943
dispcorr: -0.020551708 hartree
energy: -1782.238024520434
dipole: -0.32095 0.28500 -0.03595 11.15448 -7.81684 3.33765 -0.04446 0.04611 0.00165
magnitude: 3.33784 au
magnitude: 8.48411 debye
