program: Gaussian 09
title: 000066098
version: EM64L-G09RevD.01
frameworkgroup: C1[X(C13H9ClO)]
method: RPBEPBE
basis: SDD
operation: Freq
keyword: #p
keyword: freq=noraman
keyword: PBEPBE/SDD
title: #p freq=noraman PBEPBE/SDD
converged: YES YES NO NO
title: Mulliken charges:
elementType: Cl O C C C C C C C C C C C C C H H H H H H H H H
charge: -0.058852 -0.220597 0.317546 0.290807 0.016507 -0.336532 -0.372035 -0.361771 -0.355503 -0.104074 -0.210497 -0.235740 -0.229684 -0.228938 -0.227045 0.294954 0.276911 0.266421 0.272657 0.239592 0.234366 0.234835 0.261490 0.235178
chargesum: 0.00000
title: Mulliken charges with hydrogens summed into heavy atoms:
elementType: Cl O C C C C C C C C C C C C C
charge: -0.058852 -0.220597 0.317546 0.290807 0.016507 -0.041578 -0.095124 -0.095350 -0.082846 -0.104074 0.029095 -0.001373 0.005152 0.032552 0.008134
polarizability: 2.09885355e+02 1.01500606e+01 1.62797480e+02 1.58014208e+01 -5.49702676e+00 8.07510144e+01
1716.lowfreq: -9.6587 -6.8320 -0.0021 -0.0021 -0.0018 6.8088 42.3767 53.7523 70.5138
frequency: 42.3341 53.7277 70.5116 127.1454 168.9835 193.0920 218.0539 280.8787 302.4378 354.1682 394.1981 404.8165 429.4916 443.8031 478.8642 567.7345 613.1906 634.7341 663.9955 677.5934 701.2175 721.3540 756.4010 791.0408 817.8800 862.2543 908.8780 923.6678 933.4111 950.1250 984.3313 989.2000 990.9792 992.0561 1006.2950 1026.5379 1073.3368 1085.4988 1093.7133 1153.8964 1175.1955 1177.0090 1191.1059 1269.1423 1298.5744 1320.6104 1377.4479 1383.8730 1407.2916 1433.5498 1459.0168 1477.5357 1537.6727 1570.0027 1586.8431 1601.3993 1608.2765 3130.0832 3139.5167 3146.0092 3150.3812 3159.8786 3166.3276 3169.1748 3170.8507 3177.9207
redmass: 6.5727 4.7666 5.4005 6.8086 6.7794 4.8900 5.1703 6.1127 6.0164 8.8409 7.2750 2.8524 3.4917 4.2711 5.2116 5.4964 6.4520 6.8477 5.4236 4.0003 2.0804 1.7850 5.3423 1.8178 2.0354 1.2514 1.5678 1.9594 2.0469 1.5183 5.6862 4.7742 1.4839 1.3669 1.3366 2.1927 2.1873 1.5866 1.5876 3.1567 1.0576 1.0848 1.1208 2.1226 1.7387 1.3449 9.1205 8.7928 2.8810 2.2640 2.3567 2.2646 9.4257 6.5548 6.3536 6.6964 6.1581 1.0852 1.0881 1.0874 1.0925 1.0962 1.0928 1.0946 1.0992 1.0990
irintensity: 3.6237 0.4909 0.4782 1.6419 1.9500 0.9859 1.5628 0.1379 1.8502 4.7556 5.7833 0.4031 1.8865 2.7828 5.0337 5.0191 0.1929 15.5840 25.8668 12.6140 27.9746 113.4641 23.5679 28.7156 26.1946 3.9160 22.6984 12.0003 19.6928 7.6991 2.9940 3.6376 3.4434 1.1077 0.8125 2.7346 26.0701 10.3721 3.8813 25.5540 0.6615 5.7136 16.0708 237.5621 127.5986 11.1376 1.0795 2.2637 16.6737 16.3417 10.7989 2.3718 181.0530 12.1195 4.5935 12.6580 13.1927 0.2248 4.7795 6.4061 17.4025 17.9063 1.3018 4.0946 17.5574 9.3198
temp: 298.150 k
press: 1.00000 atm
elementType: 17 8 6 6 6 6 6 6 6 6 6 6 6 6 6 1 1 1 1 1 1 1 1 1
symmnumber: 1
zpe: 467539.6 jmol-1
zpe.correction: 0.178076 hartree
zpe.thermalcorrener: 0.190321 hartree
zpe.thermalcorrenthalpy: 0.191265 hartree
zpe.thermalcorrgfe: 0.138103 hartree
zpe.sumelectzpe: -1035.039719 hartree
zpe.sumelectthermal: -1035.027475 hartree
zpe.sumelectthermalent: -1035.026531 hartree
zpe.sumelectthermalfe: -1035.079693 hartree
dipole: -0.3322 -1.4447 1.2569
dipole: 1.9435
quadrupole: -78.9523 -97.5503 -94.0791
quadrupole: 13.5640 4.5373 0.1653
quadrupole: 11.2416 -7.3564 -3.8852 13.5640 4.5373 0.1653
hfenergy: -1035.2177955 hartree
pointgroup: C01 [X(C13H9Cl1O1)]
dipole: -0.1886879 0.7158136 -0.1915466 debye
dipolederiv: -0.2348669 -0.1617466 -0.1093738 -0.2702223 -0.4728971 -0.3159555 -0.1958311 -0.3193587 -0.3259223 -0.8368137 -0.0524926 -0.0119204 0.0311489 -0.9416171 -0.1478575 -0.0619525 -0.1170489 -0.3296788 -0.658032 -0.1583005 -0.007665 -0.1006258 -0.0585271 0.0401618 0.0418067 0.0326203 0.0353247 -0.6153752 0.2542534 0.0985002 0.2786388 -0.229884 -0.0853285 0.1007687 -0.0654996 -0.0387315 2.0216126 -0.0824347 -0.1002201 -0.2082428 0.9799573 0.1976667 -0.135276 0.1740451 0.1850371 -0.0667383 -0.1151265 -0.1082395 0.090885 -0.1817747 -0.1099289 -0.0696716 -0.0851459 -0.1265175 -0.0171659 0.1045246 0.0508675 -0.1159914 -0.029421 0.0958168 -0.0332724 0.0408333 -0.0769462 0.0169858 0.0552616 -0.070378 -0.2136079 0.0326556 0.0263944 -0.1240408 -0.0076858 -0.0626047 0.0836365 -0.1404917 -0.0394786 0.1290588 0.062013 -0.0636909 -0.0087024 0.0017474 -0.1032146 0.141881 0.30325 0.2100245 0.4522346 0.6572311 0.5609539 0.3649283 0.5481909 0.3796418 0.0348015 -0.0479426 -0.0917806 -0.0733632 -0.0529106 0.0974416 -0.1207411 0.087303 -0.0269219 -0.2575609 0.0140241 0.0188351 -0.0292356 0.1385386 -0.0610801 0.0523755 -0.0569504 -0.1428747 0.0360859 0.132459 -0.1049762 0.1569196 -0.1444573 -0.050502 -0.1026733 -0.0514347 -0.0992207 -0.0113064 0.0011889 -0.0374647 -0.0515341 -0.1826489 -0.0793185 -0.0686904 -0.0729386 -0.1574118 0.0772078 -0.0755756 -0.0714483 -0.0571516 0.0585912 -0.0083906 -0.0677358 -0.0128038 -0.1037521 0.101466 0.0282827 0.0583496 0.0431695 0.0767868 -0.0501856 0.0964796 -0.0381581 0.0822368 0.1177207 -0.0556252 -0.0308529 -0.0102715 0.06011 -0.0883957 -0.022301 -0.0585557 0.1001951 0.0093771 -0.0633209 0.0759935 -0.091568 0.0663108 0.0251017 0.0974312 0.0132999 0.0900235 0.1280288 0.0258868 0.0131361 -0.0226835 -0.012938 0.0477043 -0.0089671 0.0194997 0.1442721 -0.0172154 0.0400649 0.0800884 0.0447831 0.0720113 -0.0883296 0.0877712 -0.0895128 0.0545319 0.0869827 -0.0030533 0.0239189 0.0350879 -0.0997872 0.0516321 0.027607 0.052744 0.1331372 -0.0653715 -0.0531304 0.0895614 -0.0646302 0.056993 0.045299 0.0943196 0.0462175 0.1137169 -0.0269316 -0.0472146 0.010634 -0.0584193 0.1147703 -0.027635 0.0020445 -0.027805 0.1375769 -0.0484086 0.0972593 0.0538889 0.1056211 0.0308939 -0.0115738 0.0543233 -0.013603 0.1381028 unknown
polarizability: 209.6120564|2.6631659|151.178805|-21.567715|27.5859918|92.6429882 unknown
InChI: InChI=1S/C13H9ClO/c14-12-8-4-7-11(9-12)13(15)10-5-2-1-3-6-10/h1-9H
charge 0 multiplicity 1
24 atoms
Cl 3.241436 2.209138 1.380302
O  -0.688036 -2.38925 -0.719782
C  0.927098 -0.628248 -0.494634
C  -1.637619 -0.256637 -0.140623
C  -0.483283 -1.160842 -0.465519
C  1.347776 0.447547 0.332985
C  1.874797 -1.287587 -1.32234
C  -1.63038 1.135901 -0.427623
C  -2.810688 -0.845886 0.405991
C  2.697703 0.840413 0.301119
C  3.217763 -0.863263 -1.345481
C  -2.771836 1.922929 -0.160256
C  -3.942023 -0.056062 0.687435
C  3.645549 0.211599 -0.52881
C  -3.925107 1.332254 0.406024
H  0.646266 0.942063 1.010395
H  1.536105 -2.132979 -1.929096
H  -0.751514 1.596408 -0.890757
H  -2.81041 -1.924505 0.594857
H  3.943527 -1.366019 -1.992939
H  -2.763212 2.992312 -0.397239
H  -4.836796 -0.516425 1.120124
H  4.687513 0.544449 -0.533073
H  -4.80703 1.946393 0.619739
