program: Orca
programVersion: 5.0.2
elementType: S S O O O O N N N N C C C C C C C C C C C C H H H H H H H H H H H H H H
charge: 0
multiplicity: 1
keywords: wb97x-d3
keywords: def2-TZVPP
keywords: def2/J RIJCOSX
keywords: DEFGRID2
keywords: scfconv7
keywords: smallprint printgap noloewdin
keywords: NOSOSCF
formula: C12H14N4O4S2
InChI: InChI=1/C12H14N4O4S2/c1-19-11(17)15-9(21)13-7-5-3-4-6-8(7)14-10(22)16-12(18)20-2/h3-6,13-16H,1-2H3
36 atoms
S  2.121736 -0.72994 2.246583
S  -3.81503 -1.482161 -0.503081
O  2.821685 3.107507 -0.476887
O  -2.569717 3.038568 0.169063
O  1.937532 1.480482 -1.744251
O  -0.713563 1.784706 0.296715
N  1.428239 -0.762678 -0.317197
N  -1.24597 -0.848722 0.030351
N  2.497835 1.137585 0.45526
N  -2.785509 0.854684 -0.032085
C  0.799936 -2.026976 -0.192936
C  -0.5944 -2.08245 -0.052183
C  1.55089 -3.186549 -0.239393
C  -1.2120 -3.326401 0.03383
C  0.931155 -4.421718 -0.157039
C  -0.446202 -4.479767 -0.021026
C  1.999078 -0.127311 0.719086
C  -2.527118 -0.512269 -0.152353
C  2.371481 1.877883 -0.690528
C  -1.911171 1.888358 0.158534
C  2.759573 4.00447 -1.577615
C  -1.794318 4.213579 0.372698
H  2.625198 -3.108506 -0.336113
H  -2.281388 -3.392219 0.147525
H  1.41225 -0.288302 -1.214938
H  -0.622383 -0.064025 0.203553
H  1.519163 -5.328332 -0.194126
H  -0.942971 -5.438169 0.049715
H  2.879134 1.591522 1.271736
H  -3.762229 1.080454 -0.150874
H  1.732736 4.155502 -1.911429
H  3.166268 4.944473 -1.215717
H  3.35412 3.650665 -2.41957
H  -1.279076 4.191949 1.332621
H  -1.060065 4.35065 -0.421196
H  -2.500828 5.038139 0.35833
totalener: -1782.18958710 hartree
nucrepener: 2164.17967543 hartree
electener: -3946.36926253 hartree
oneelecener: -6749.07576510 hartree
twoeener: 2802.70650257 hartree
kineticenergy: 1776.95488982 hartree
xcener: -130.084668830746 hartree
chargesum: 0.0000000
charge: -0.313003 -0.344331 -0.291644 -0.289865 -0.419000 -0.437164 -0.205171 -0.149803 -0.144194 -0.159755 0.096622 0.078791 -0.114644 -0.119640 -0.110031 -0.109926 0.145559 0.204189 0.499445 0.509562 -0.120673 -0.121120 0.119434 0.143711 0.202090 0.183410 0.123945 0.126396 0.160807 0.161186 0.105405 0.122236 0.118429 0.117834 0.104308 0.126603
qa: -0.3130 -0.3443 -0.2916 -0.2899 -0.4190 -0.4372 -0.2052 -0.1498 -0.1442 -0.1598 0.0966 0.0788 -0.1146 -0.1196 -0.1100 -0.1099 0.1456 0.2042 0.4994 0.5096 -0.1207 -0.1211 0.1194 0.1437 0.2021 0.1834 0.1239 0.1264 0.1608 0.1612 0.1054 0.1222 0.1184 0.1178 0.1043 0.1266
va: 2.1046 2.0646 2.1086 2.1184 2.0811 2.0726 3.1669 3.3097 3.2060 3.2102 3.7889 4.0387 4.0716 3.9788 3.9753 4.0021 4.3749 4.3007 4.2649 4.2423 3.8851 3.8891 1.0128 1.0496 1.0377 1.0561 1.0011 1.0007 1.0522 1.0525 0.9931 0.9931 0.9970 0.9946 0.9929 0.9946
dispcorr: -0.018911966 hartree
energy: -1782.208499070638
dipole: 4.22992 -3.59147 0.63845 10.95371 -8.53501 2.41870 -4.43546 3.69297 -0.74249
magnitude: 2.60941 au
magnitude: 6.63259 debye
