program: Orca
programVersion: 5.0.2
elementType: S S O O O O N N N N C C C C C C C C C C C C H H H H H H H H H H H H H H
charge: 0
multiplicity: 1
keywords: wb97x-d3
keywords: def2-TZVPP
keywords: def2/J RIJCOSX
keywords: DEFGRID2
keywords: scfconv7
keywords: smallprint printgap noloewdin
keywords: NOSOSCF
formula: C12H14N4O4S2
InChI: InChI=1/C12H14N4O4S2/c1-19-11(17)15-9(21)13-7-5-3-4-6-8(7)14-10(22)16-12(18)20-2/h3-6,13-16H,1-2H3
36 atoms
S  3.187165 -1.194716 1.768329
S  -3.187134 -1.196084 -1.768043
O  2.887624 3.047404 -0.347647
O  -2.888698 3.046266 0.347622
O  1.241753 1.742302 -1.139236
O  -1.242317 1.741745 1.139105
N  1.346391 -0.761322 -0.127594
N  -1.346191 -0.761933 0.127558
N  2.793739 0.964449 0.362195
N  -2.794261 0.963276 -0.36205
C  0.698222 -2.007372 -0.034159
C  -0.697481 -2.007689 0.034036
C  1.389969 -3.210668 -0.066252
C  -1.388677 -3.211306 0.066051
C  0.694048 -4.405161 -0.032248
C  -0.692204 -4.405476 0.031965
C  2.380989 -0.339399 0.612522
C  -2.381079 -0.340437 -0.612395
C  2.213816 1.90942 -0.441539
C  -2.21452 1.908503 0.441515
C  2.414229 4.135503 -1.131579
C  -2.415541 4.134581 1.131396
H  2.467989 -3.204408 -0.121832
H  -2.466698 -3.205553 0.121639
H  0.937679 -0.080071 -0.762266
H  -0.937657 -0.080493 0.762143
H  1.238013 -5.339398 -0.061121
H  -1.235746 -5.339963 0.060775
H  3.58776 1.241387 0.920215
H  -3.588466 1.239907 -0.919959
H  3.085198 4.963105 -0.921146
H  2.442626 3.905155 -2.196219
H  1.39651 4.412826 -0.857384
H  -2.443526 3.90425 2.19605
H  -1.398021 4.412328 0.856894
H  -3.086919 4.961895 0.921138
totalener: -1782.18966995 hartree
nucrepener: 2143.11025786 hartree
electener: -3925.29992781 hartree
oneelecener: -6706.91363184 hartree
twoeener: 2781.61370403 hartree
kineticenergy: 1776.95586139 hartree
xcener: -130.083382513386 hartree
chargesum: 0.0000000
charge: -0.336882 -0.336876 -0.289004 -0.289001 -0.423311 -0.423308 -0.202567 -0.202536 -0.157882 -0.157891 0.115964 0.115701 -0.109680 -0.109464 -0.113306 -0.113220 0.188719 0.188711 0.497254 0.497246 -0.117791 -0.117785 0.125718 0.125660 0.189355 0.189362 0.125137 0.125131 0.162210 0.162206 0.123928 0.117539 0.104599 0.117540 0.104599 0.123928
qa: -0.3369 -0.3369 -0.2890 -0.2890 -0.4233 -0.4233 -0.2026 -0.2025 -0.1579 -0.1579 0.1160 0.1157 -0.1097 -0.1095 -0.1133 -0.1132 0.1887 0.1887 0.4973 0.4972 -0.1178 -0.1178 0.1257 0.1257 0.1894 0.1894 0.1251 0.1251 0.1622 0.1622 0.1239 0.1175 0.1046 0.1175 0.1046 0.1239
va: 2.0750 2.0749 2.1141 2.1141 2.0741 2.0741 3.2408 3.2408 3.2069 3.2069 3.8358 3.8364 4.0375 4.0374 3.9969 3.9968 4.3357 4.3357 4.2576 4.2576 3.8882 3.8882 1.0280 1.0280 1.0487 1.0487 1.0007 1.0007 1.0513 1.0513 0.9938 0.9956 0.9915 0.9956 0.9915 0.9938
dispcorr: -0.018013946 hartree
energy: -1782.207683895530
dipole: -0.00083 0.00057 -0.00026 11.27604 -8.81004 2.46600 -0.00097 0.00082 -0.00016
magnitude: 2.46600 au
magnitude: 6.26808 debye
