program: Orca
programVersion: 5.0.2
elementType: Cl O O O O O N C C C C C C C C C C C C C C C C C C H H H H H H H H H H H H H H H H H H H H
charge: 0
multiplicity: 1
keywords: wb97x-d3
keywords: def2-TZVPP
keywords: def2/J RIJCOSX
keywords: DEFGRID2
keywords: scfconv7
keywords: smallprint printgap noloewdin
keywords: NOSOSCF
formula: C18H20ClNO5
InChI: InChI=1/C18H20ClNO5/c1-9-7-12(22-3)16(23-4)17(24-5)13(9)15(21)14-10(2)11(19)8-20-18(14)25-6/h7-8H,1-6H3
45 atoms
Cl 5.021592 1.10549 0.691465
O  -0.207143 1.363736 0.773922
O  -2.748468 2.365374 0.23318
O  -4.766461 0.691658 -0.144453
O  0.625769 -2.310354 1.461697
O  0.468846 -1.198961 -1.9533
N  2.478134 -0.102919 -2.058873
C  -0.99844 -0.853948 0.557868
C  -2.067872 -1.745697 0.387185
C  -1.237414 0.527984 0.507342
C  0.38024 -1.34297 0.767183
C  1.507434 -0.659855 0.058921
C  -2.510813 1.024517 0.272834
C  -3.336553 -1.238778 0.131292
C  -3.570247 0.13122 0.078107
C  2.588996 -0.122804 0.744392
C  -1.901259 -3.238385 0.404936
C  1.509705 -0.629643 -1.343887
C  3.613326 0.417878 -0.040833
C  2.658439 -0.06796 2.236291
C  3.515501 0.417411 -1.414235
C  0.168749 2.314671 -0.221225
C  -3.025813 2.943461 1.506084
C  -5.893082 -0.153258 -0.31479
C  0.376107 -1.118979 -3.369881
H  -4.146119 -1.938264 -0.027495
H  -1.742712 -3.617876 1.413903
H  -2.79646 -3.717971 0.012821
H  -1.058715 -3.566964 -0.203413
H  3.367292 -0.804994 2.617144
H  3.004488 0.909989 2.567864
H  1.699171 -0.254285 2.709923
H  4.300546 0.850783 -2.021852
H  -0.123104 1.995923 -1.222833
H  -0.262788 3.294702 -0.017306
H  1.25468 2.401206 -0.186531
H  -3.912327 2.50038 1.965928
H  -3.210833 4.003411 1.342489
H  -2.183936 2.836313 2.19348
H  -6.075899 -0.767367 0.569401
H  -5.785128 -0.80143 -1.186863
H  -6.74557 0.503179 -0.469035
H  0.345767 -0.085123 -3.714688
H  1.198956 -1.637906 -3.861554
H  -0.558936 -1.607789 -3.630685
elementType: Cl O N C H
totalener: -1589.10890927 hartree
nucrepener: 2511.22166457 hartree
electener: -4100.33057384 hartree
oneelecener: -7170.30001744 hartree
twoeener: 3069.96944360 hartree
cpcmener: -0.03450131 hartree
kineticenergy: 1583.69746250 hartree
xcener: -128.265078569692 hartree
chargesum: -0.0000000
charge: -0.090027 -0.365634 -0.398568 -0.327670 -0.431045 -0.313729 -0.408001 -0.166345 -0.031754 0.229095 0.245836 0.059012 0.184230 -0.195234 0.282453 0.028266 -0.233012 0.372920 0.021463 -0.266387 -0.000330 -0.132125 -0.106318 -0.129396 -0.125086 0.127770 0.103712 0.094151 0.103190 0.129142 0.102556 0.099738 0.127990 0.119984 0.125165 0.118819 0.107861 0.124446 0.107956 0.117203 0.117865 0.126486 0.109318 0.110267 0.123767
qa: -0.0900 -0.3656 -0.3986 -0.3277 -0.4310 -0.3137 -0.4080 -0.1663 -0.0318 0.2291 0.2458 0.0590 0.1842 -0.1952 0.2825 0.0283 -0.2330 0.3729 0.0215 -0.2664 -0.0003 -0.1321 -0.1063 -0.1294 -0.1251 0.1278 0.1037 0.0942 0.1032 0.1291 0.1026 0.0997 0.1280 0.1200 0.1252 0.1188 0.1079 0.1244 0.1080 0.1172 0.1179 0.1265 0.1093 0.1103 0.1238
va: 1.2332 1.9821 1.9418 2.0775 2.0235 2.0870 3.0283 3.5707 3.8343 3.9025 3.8216 3.4486 3.8131 3.8497 3.9442 3.7373 3.8862 3.9494 3.8731 3.9461 4.1379 3.8733 3.8358 3.8640 3.8747 1.0170 1.0047 1.0055 1.0040 0.9950 1.0030 1.0126 1.0091 0.9849 0.9977 0.9877 0.9927 0.9928 0.9912 0.9875 0.9856 0.9929 0.9957 0.9970 0.9938
dispcorr: -0.026503548 hartree
energy: -1589.135412820555
dipole: -28.05741 26.02011 -2.03730 -1.58233 2.17275 0.59042 -2.57839 1.84091 -0.73749
magnitude: 2.24568 au
magnitude: 5.70806 debye
