program: Orca
programVersion: 5.0.2
elementType: Cl O O O O O N C C C C C C C C C C C C C C C C C C H H H H H H H H H H H H H H H H H H H H
charge: 0
multiplicity: 1
keywords: wb97x-d3
keywords: def2-TZVPP
keywords: def2/J RIJCOSX
keywords: DEFGRID2
keywords: scfconv7
keywords: smallprint printgap noloewdin
keywords: NOSOSCF
formula: C18H20ClNO5
InChI: InChI=1/C18H20ClNO5/c1-9-7-12(22-3)16(23-4)17(24-5)13(9)15(21)14-10(2)11(19)8-20-18(14)25-6/h7-8H,1-6H3
45 atoms
Cl 3.825455 1.19418 2.08856
O  -0.408185 0.930408 -1.249294
O  -2.707955 2.197899 -0.337165
O  -4.345048 0.955713 1.293951
O  0.325292 -2.83783 -0.86226
O  1.773785 -1.183696 -2.726682
N  3.362478 0.064457 -1.653782
C  -0.987665 -1.049378 -0.046147
C  -1.896195 -1.736782 0.771718
C  -1.261703 0.275734 -0.419577
C  0.273624 -1.683136 -0.490063
C  1.525657 -0.864765 -0.431462
C  -2.398471 0.928642 0.030783
C  -3.028234 -1.070817 1.227138
C  -3.283639 0.250641 0.87917
C  1.983805 -0.317591 0.758523
C  -1.683969 -3.153616 1.222633
C  2.261402 -0.648678 -1.608367
C  3.160631 0.439014 0.680928
C  1.280232 -0.512838 2.063997
C  3.806433 0.602139 -0.522243
C  -0.81344 0.962202 -2.6165
C  -1.82653 3.228972 0.102799
C  -5.277417 0.332187 2.161704
C  2.447993 -0.934288 -3.953015
H  -3.704583 -1.60133 1.883892
H  -2.380491 -3.400437 2.021969
H  -1.849957 -3.864462 0.413647
H  -0.675431 -3.322127 1.601153
H  1.994215 -0.627688 2.877742
H  0.656488 0.351754 2.299063
H  0.645538 -1.394471 2.068276
H  4.717916 1.184029 -0.583847
H  -1.721943 1.550353 -2.758269
H  -0.004993 1.427911 -3.176218
H  -0.981677 -0.044495 -3.004624
H  -2.431739 4.114775 0.289686
H  -1.082907 3.472707 -0.656378
H  -1.315813 2.957515 1.027751
H  -6.039077 1.077336 2.376386
H  -4.812969 0.022261 3.10028
H  -5.752497 -0.532299 1.69315
H  1.870182 -1.449148 -4.716028
H  2.482774 0.12922 -4.188072
H  3.462415 -1.332093 -3.945391
elementType: Cl O N C H
totalener: -1589.10652350 hartree
nucrepener: 2510.67498413 hartree
electener: -4099.78150763 hartree
oneelecener: -7169.12248623 hartree
twoeener: 3069.34097860 hartree
cpcmener: -0.03852518 hartree
kineticenergy: 1583.70250740 hartree
xcener: -128.265679601212 hartree
chargesum: -0.0000000
charge: -0.090339 -0.389606 -0.392226 -0.327720 -0.419288 -0.306479 -0.409012 -0.131167 0.008971 0.254452 0.258634 0.069040 0.125355 -0.181042 0.219666 -0.037969 -0.228258 0.371521 0.033190 -0.240183 -0.004751 -0.131407 -0.098865 -0.127167 -0.130283 0.126885 0.094790 0.105112 0.104308 0.110884 0.123546 0.104467 0.126961 0.122630 0.125730 0.115479 0.120221 0.103661 0.108771 0.126377 0.117029 0.116832 0.127060 0.107231 0.116956
qa: -0.0903 -0.3896 -0.3922 -0.3277 -0.4193 -0.3065 -0.4090 -0.1312 0.0090 0.2545 0.2586 0.0690 0.1254 -0.1810 0.2197 -0.0380 -0.2283 0.3715 0.0332 -0.2402 -0.0048 -0.1314 -0.0989 -0.1272 -0.1303 0.1269 0.0948 0.1051 0.1043 0.1109 0.1235 0.1045 0.1270 0.1226 0.1257 0.1155 0.1202 0.1037 0.1088 0.1264 0.1170 0.1168 0.1271 0.1072 0.1170
va: 1.2341 1.9199 1.9684 2.0791 2.0379 2.0913 3.0205 3.5210 3.7672 3.7970 3.8950 3.3138 3.9054 3.8426 3.9803 3.8159 3.8922 3.9827 3.8609 3.9395 4.1529 3.8368 3.8519 3.8646 3.8645 1.0176 1.0059 1.0045 0.9990 1.0108 0.9939 1.0055 1.0092 0.9974 0.9900 0.9917 0.9953 0.9881 0.9910 0.9929 0.9863 0.9862 0.9935 0.9978 0.9989
dispcorr: -0.026119376 hartree
energy: -1589.132642873135
dipole: -21.60942 20.20285 -1.40656 -2.01208 2.74960 0.73752 -3.44952 4.45992 1.01040
magnitude: 1.88236 au
magnitude: 4.78458 debye
