program: Gaussian 09
title: 000066094
version: EM64L-G09RevD.01
frameworkgroup: C1[X(C6H21N3Si3)]
method: RPBEPBE
basis: SDD
operation: Freq
keyword: #p
keyword: freq=noraman
keyword: PBEPBE/SDD
title: #p freq=noraman PBEPBE/SDD
converged: YES YES NO NO
title: Mulliken charges:
elementType: Si Si Si N N N C C C C C C H H H H H H H H H H H H H H H H H H H H H
charge: 1.600295 1.557942 1.601048 -1.217604 -1.261197 -1.219870 -1.029707 -1.046906 -1.077397 -1.020179 -1.046336 -1.031812 0.312465 0.330266 0.313965 0.230084 0.225574 0.240718 0.234877 0.226972 0.245039 0.243785 0.240451 0.240858 0.229429 0.243134 0.229463 0.245512 0.226707 0.234769 0.230712 0.241009 0.225937
chargesum: 0.00000
title: Mulliken charges with hydrogens summed into heavy atoms:
elementType: Si Si Si N N N C C C C C C
charge: 1.600295 1.557942 1.601048 -0.905139 -0.930931 -0.905905 -0.333332 -0.340019 -0.352303 -0.318153 -0.339349 -0.334154
polarizability: 1.55967222e+02 4.61715994e-03 1.56245782e+02 1.50862807e-01 9.73631370e-01 1.43598868e+02
1716.lowfreq: -17.6044 -10.2261 -7.8101 0.0007 0.0017 0.0019 22.2539 51.4935 64.5010
frequency: 21.2082 51.0428 64.4672 126.9152 135.2832 137.6727 142.5902 149.2892 152.4776 160.6728 166.1038 168.5591 169.5176 174.0137 184.3840 209.0259 212.8534 239.9879 247.6664 250.1765 306.7029 314.0936 330.8484 414.9627 426.9892 459.3668 484.2114 596.4514 606.9408 623.0594 665.0263 673.9032 688.1691 692.4394 698.5964 703.1233 783.2854 796.0901 802.8698 815.2838 817.3368 843.0261 845.4384 858.0280 858.4944 874.6233 905.3825 906.1365 915.6767 939.8485 940.2712 1185.8847 1213.0878 1237.7626 1286.3393 1286.7985 1290.9994 1296.5722 1298.4798 1304.2388 1438.2477 1439.6851 1439.9755 1442.5040 1444.2520 1446.6755 1450.0670 1451.7059 1452.4606 1453.0788 1455.6135 1459.2176 2976.2526 2976.5936 2978.5025 2978.7780 2980.1911 2982.6266 3076.6935 3077.3269 3079.7876 3080.4498 3083.1946 3088.1550 3089.2967 3089.5498 3090.1213 3090.4403 3091.0400 3091.3890 3524.4128 3535.7273 3536.5119
redmass: 2.9297 3.0266 3.0289 2.4839 1.0329 1.0540 1.0923 1.5354 1.7131 1.1919 1.8081 2.3054 1.5512 1.2280 2.5475 2.9966 3.0248 2.8707 2.4820 3.3883 2.9855 3.6265 1.9204 4.2100 1.6313 1.9381 1.4324 3.8688 4.1253 4.2581 3.4838 3.2899 2.6054 2.5446 3.4106 2.2495 1.2836 1.2819 1.3399 1.6972 1.5272 1.3820 1.9211 2.1105 2.1625 3.4891 1.8120 1.8590 1.6038 2.5782 2.5841 1.1978 1.2504 1.2070 1.2155 1.2150 1.2122 1.1988 1.2000 1.2040 1.0551 1.0530 1.0525 1.0537 1.0534 1.0534 1.0502 1.0489 1.0493 1.0493 1.0489 1.0482 1.0344 1.0343 1.0344 1.0343 1.0337 1.0345 1.0979 1.0977 1.0974 1.0971 1.0976 1.0985 1.0985 1.0989 1.0983 1.0987 1.0984 1.0983 1.0738 1.0745 1.0744
irintensity: 0.0798 0.3141 0.0962 0.5770 0.0870 0.0138 0.0354 0.3718 0.3309 0.1033 0.2819 0.0454 0.3590 0.2133 0.0329 0.6289 2.6185 0.0998 1.3230 9.7165 3.2244 9.5640 1.0231 2.7123 61.6170 135.3127 73.4678 27.3477 30.4471 1.4301 1.1044 2.7195 1.0972 19.5417 9.8605 26.7595 1.1247 0.9651 2.0688 8.2521 7.8115 1.8066 228.0566 23.9259 15.0523 32.0552 248.1480 195.5031 23.3777 491.8155 508.7428 41.3917 220.6301 203.0756 21.7992 4.7906 127.8623 36.2223 20.8292 26.9908 0.2895 2.3051 1.6901 2.7329 6.1456 0.9732 4.6948 3.5878 4.1233 6.4864 13.1670 12.3777 12.1087 19.2950 20.1998 12.2483 14.1225 13.6620 4.8992 0.4982 25.3247 46.3647 8.4492 34.8127 13.4193 9.8529 27.9134 29.2689 22.6114 17.7924 6.4337 8.7922 4.7119
temp: 298.150 k
press: 1.00000 atm
elementType: 14 14 14 7 7 7 6 6 6 6 6 6 1 1 1 1 1 1 1 1 1 1 1 1 1 1 1 1 1 1 1 1 1
symmnumber: 1
zpe: 711905.3 jmol-1
zpe.correction: 0.271150 hartree
zpe.thermalcorrener: 0.291281 hartree
zpe.thermalcorrenthalpy: 0.292225 hartree
zpe.thermalcorrgfe: 0.223861 hartree
zpe.sumelectzpe: -1272.845368 hartree
zpe.sumelectthermal: -1272.825238 hartree
zpe.sumelectthermalent: -1272.824293 hartree
zpe.sumelectthermalfe: -1272.892658 hartree
dipole: -0.0145 -0.0218 -0.4178
dipole: 0.4187
quadrupole: -94.7103 -95.9981 -98.4288
quadrupole: -0.2254 -0.3152 -4.5465
quadrupole: 1.6688 0.3810 -2.0497 -0.2254 -0.3152 -4.5465
hfenergy: -1273.1165186 hartree
pointgroup: C01 [X(C6H21N3Si3)]
dipole: 0.0023138 0.00667 0.1645626 debye
polarizability: 156.157607|0.085725|156.004137|1.0544251|0.7101171|143.6501282 unknown
InChI: InChI=1S/C6H21N3Si3/c1-10(2)7-11(3,4)9-12(5,6)8-10/h7-9H,1-6H3
charge 0 multiplicity 1
33 atoms
Si 0.003811 1.836945 -0.101757
Si -1.615578 -0.854522 -0.012892
Si 1.521126 -1.020049 -0.100362
N  -1.438131 0.890758 0.346579
N  1.142528 0.609844 -0.729709
N  -0.066995 -1.656217 0.394957
C  0.633771 2.772372 1.441958
C  -0.293377 3.086099 -1.517479
C  -2.980235 -1.566343 1.113164
C  -2.02882 -1.112529 -1.85664
C  2.342681 -1.982499 -1.532629
C  2.682468 -1.032951 1.418132
H  -2.132711 1.319902 0.965414
H  1.631824 0.871513 -1.592003
H  -0.096836 -2.430387 1.065103
H  1.530767 3.372255 1.201295
H  -0.138292 3.459031 1.838861
H  0.90053 2.058617 2.242287
H  -1.023761 3.857767 -1.21114
H  0.640636 3.604335 -1.806657
H  -0.699788 2.570097 -2.406013
H  -2.726739 -1.419657 2.178754
H  -3.951318 -1.074171 0.919711
H  -3.116632 -2.649283 0.936785
H  -2.977984 -0.612594 -2.123773
H  -1.225795 -0.681247 -2.481794
H  -2.114772 -2.187885 -2.098103
H  1.658287 -2.040037 -2.39811
H  3.285077 -1.503227 -1.859473
H  2.582619 -3.016228 -1.221826
H  3.685304 -0.650131 1.153319
H  2.271201 -0.395398 2.221489
H  2.805435 -2.056383 1.821455
