program: Orca
programVersion: 5.0.2
elementType: Cl O O O O O N C C C C C C C C C C C C C C C C C C H H H H H H H H H H H H H H H H H H H H
charge: 0
multiplicity: 1
keywords: wb97x-d3
keywords: def2-TZVPP
keywords: def2/J RIJCOSX
keywords: DEFGRID2
keywords: scfconv7
keywords: smallprint printgap noloewdin
keywords: NOSOSCF
formula: C18H20ClNO5
InChI: InChI=1/C18H20ClNO5/c1-9-7-12(22-3)16(23-4)17(24-5)13(9)15(21)14-10(2)11(19)8-20-18(14)25-6/h7-8H,1-6H3
45 atoms
Cl 5.163729 0.905154 0.530133
O  -0.211562 1.389868 0.825156
O  -2.754057 2.360563 0.183924
O  -4.734494 0.651198 -0.24827
O  0.653716 -2.191127 1.648508
O  0.34782 -1.11003 -1.871281
N  2.384704 -0.099857 -2.062876
C  -0.98177 -0.825142 0.63402
C  -2.030251 -1.735275 0.454785
C  -1.232986 0.551049 0.547056
C  0.403816 -1.290372 0.874598
C  1.516732 -0.660091 0.0990
C  -2.504965 1.026015 0.258982
C  -3.296048 -1.25271 0.140692
C  -3.543064 0.112415 0.04021
C  2.668195 -0.190988 0.724615
C  -1.834597 -3.223188 0.520195
C  1.43775 -0.601008 -1.302273
C  3.668672 0.315028 -0.112873
C  2.831222 -0.190337 2.211265
C  3.483827 0.353411 -1.478382
C  0.143613 2.388532 -0.127367
C  -3.153164 2.950044 1.416221
C  -5.82685 -0.209233 -0.511144
C  0.190592 -0.980043 -3.276953
H  -4.090669 -1.967225 -0.027706
H  -1.680191 -3.569362 1.541986
H  -2.712794 -3.736517 0.131068
H  -0.976718 -3.55196 -0.067262
H  3.34493 -1.094191 2.543614
H  3.428018 0.658024 2.539606
H  1.878271 -0.140705 2.731277
H  4.249285 0.763737 -2.126794
H  -0.146696 2.113756 -1.142678
H  -0.29874 3.353559 0.121443
H  1.228677 2.487918 -0.092236
H  -4.09941 2.53841 1.77711
H  -3.286151 4.015143 1.232888
H  -2.396707 2.820496 2.194425
H  -6.077423 -0.829301 0.352999
H  -5.63889 -0.854134 -1.372985
H  -6.675158 0.433446 -0.735605
H  0.202847 0.064544 -3.591421
H  0.95862 -1.526459 -3.825773
H  -0.783042 -1.408004 -3.503944
elementType: Cl O N C H
totalener: -1589.11508353 hartree
nucrepener: 2511.83832749 hartree
electener: -4100.95341102 hartree
oneelecener: -7171.38737004 hartree
twoeener: 3070.43395902 hartree
cpcmener: -0.02775022 hartree
kineticenergy: 1583.70606564 hartree
xcener: -128.265067842440 hartree
chargesum: -0.0000000
charge: -0.089692 -0.352785 -0.382097 -0.315498 -0.399715 -0.303853 -0.402725 -0.115410 -0.038912 0.206905 0.207376 0.034402 0.173600 -0.200020 0.273028 0.018538 -0.231249 0.373802 0.037012 -0.255449 -0.002427 -0.126426 -0.107821 -0.132717 -0.124930 0.124417 0.105142 0.091312 0.102870 0.124825 0.095950 0.103979 0.125773 0.115445 0.123559 0.115028 0.105847 0.122393 0.106468 0.114453 0.115454 0.124720 0.107390 0.111094 0.120943
qa: -0.0897 -0.3528 -0.3821 -0.3155 -0.3997 -0.3039 -0.4027 -0.1154 -0.0389 0.2069 0.2074 0.0344 0.1736 -0.2000 0.2730 0.0185 -0.2312 0.3738 0.0370 -0.2554 -0.0024 -0.1264 -0.1078 -0.1327 -0.1249 0.1244 0.1051 0.0913 0.1029 0.1248 0.0959 0.1040 0.1258 0.1154 0.1236 0.1150 0.1058 0.1224 0.1065 0.1145 0.1155 0.1247 0.1074 0.1111 0.1209
va: 1.2335 2.0021 1.9609 2.0894 2.0617 2.0991 3.0244 3.4936 3.8473 3.9369 3.8595 3.4403 3.8236 3.8438 3.9416 3.7620 3.8919 3.9398 3.8549 3.9328 4.1420 3.8754 3.8412 3.8716 3.8776 1.0180 1.0051 1.0056 1.0034 0.9974 1.0097 1.0095 1.0097 0.9866 0.9955 0.9887 0.9935 0.9928 0.9895 0.9863 0.9865 0.9934 0.9964 0.9974 0.9939
dispcorr: -0.026450058 hartree
energy: -1589.141533591680
dipole: -28.59274 26.67503 -1.91772 -1.01222 1.53826 0.52604 -2.45765 1.62062 -0.83703
magnitude: 2.15754 au
magnitude: 5.48403 debye
