program: Orca
programVersion: 5.0.2
elementType: Cl O O O O O N C C C C C C C C C C C C C C C C C C H H H H H H H H H H H H H H H H H H H H
charge: 0
multiplicity: 1
keywords: wb97x-d3
keywords: def2-TZVPP
keywords: def2/J RIJCOSX
keywords: DEFGRID2
keywords: scfconv7
keywords: smallprint printgap noloewdin
keywords: NOSOSCF
formula: C18H20ClNO5
InChI: InChI=1/C18H20ClNO5/c1-9-7-12(22-3)16(23-4)17(24-5)13(9)15(21)14-10(2)11(19)8-20-18(14)25-6/h7-8H,1-6H3
45 atoms
Cl 4.919849 1.152038 -1.023958
O  -0.285536 1.217068 -1.111316
O  -2.772609 2.330661 -0.549527
O  -4.732088 0.780677 0.369618
O  0.529686 -2.423428 -1.262603
O  0.596831 -1.043432 2.06102
N  2.555906 0.129881 1.947001
C  -1.023108 -0.887678 -0.35528
C  -2.047294 -1.71902 0.101971
C  -1.277682 0.469292 -0.571981
C  0.340226 -1.413527 -0.62967
C  1.500457 -0.662277 -0.050767
C  -2.529926 1.014647 -0.322036
C  -3.293214 -1.16523 0.371845
C  -3.547868 0.185588 0.160086
C  2.532252 -0.171615 -0.841094
C  -1.83626 -3.183344 0.358634
C  1.577409 -0.500639 1.338444
C  3.571116 0.483317 -0.170559
C  2.51274 -0.31958 -2.329875
C  3.53556 0.618544 1.202639
C  0.184683 2.334124 -0.373816
C  -3.246451 2.613277 -1.852819
C  -5.807379 -0.000561 0.825063
C  0.615498 -0.849376 3.462331
H  -4.070604 -1.815842 0.749609
H  -2.690015 -3.605405 0.887354
H  -1.707887 -3.738297 -0.569225
H  -0.949059 -3.362678 0.965502
H  3.130836 0.431263 -2.81446
H  2.892224 -1.300394 -2.617351
H  1.502953 -0.231243 -2.722857
H  4.332022 1.139751 1.720708
H  1.213787 2.505877 -0.686878
H  -0.403334 3.230317 -0.570218
H  0.179213 2.140461 0.701418
H  -2.528434 2.312303 -2.620653
H  -3.392269 3.690518 -1.913274
H  -4.201939 2.121713 -2.053724
H  -6.066386 -0.798406 0.122236
H  -6.658007 0.670658 0.917383
H  -5.60857 -0.446627 1.8041
H  0.580472 0.208708 3.726522
H  -0.275317 -1.345161 3.839591
H  1.501757 -1.288502 3.922165
totalener: -1589.09650301 hartree
nucrepener: 2513.75881814 hartree
electener: -4102.85532115 hartree
oneelecener: -7174.18124112 hartree
twoeener: 3071.32591996 hartree
kineticenergy: 1583.78540955 hartree
xcener: -128.274066507583 hartree
chargesum: -0.0000000
charge: -0.079278 -0.332815 -0.344085 -0.275850 -0.300458 -0.283732 -0.359619 -0.036901 -0.064106 0.174323 0.110235 0.116053 0.197921 -0.165123 0.240459 -0.083281 -0.230152 0.326303 0.070002 -0.230916 -0.017308 -0.139682 -0.114447 -0.145590 -0.124408 0.091563 0.071714 0.116434 0.097279 0.088283 0.123665 0.103826 0.109684 0.110738 0.126122 0.102399 0.101205 0.109898 0.098442 0.101753 0.118564 0.101967 0.102702 0.109407 0.106810
qa: -0.0793 -0.3328 -0.3441 -0.2759 -0.3005 -0.2837 -0.3596 -0.0369 -0.0641 0.1743 0.1102 0.1161 0.1979 -0.1651 0.2405 -0.0833 -0.2302 0.3263 0.0700 -0.2309 -0.0173 -0.1397 -0.1144 -0.1456 -0.1244 0.0916 0.0717 0.1164 0.0973 0.0883 0.1237 0.1038 0.1097 0.1107 0.1261 0.1024 0.1012 0.1099 0.0984 0.1018 0.1186 0.1020 0.1027 0.1094 0.1068
va: 1.2435 2.0019 1.9932 2.1221 2.1563 2.1047 3.0466 3.4648 3.9484 3.9343 3.9681 3.3468 3.8002 3.8374 3.9963 3.8188 3.9070 3.9660 3.8194 3.9259 4.1539 3.9023 3.8757 3.9063 3.9001 1.0249 1.0055 1.0054 1.0065 1.0163 1.0018 1.0118 1.0120 0.9855 1.0000 0.9887 0.9887 0.9956 0.9934 0.9867 0.9964 0.9858 1.0000 0.9930 0.9987
dispcorr: -0.026679024 hartree
energy: -1589.123182038335
dipole: -27.57380 26.16250 -1.41130 -1.95898 2.32538 0.36639 4.48251 -3.88548 0.59703
magnitude: 1.57558 au
magnitude: 4.00481 debye
