program: Orca
programVersion: 5.0.2
elementType: Cl O O O O O N C C C C C C C C C C C C C C C C C C H H H H H H H H H H H H H H H H H H H H
charge: 0
multiplicity: 1
keywords: wb97x-d3
keywords: def2-TZVPP
keywords: def2/J RIJCOSX
keywords: DEFGRID2
keywords: scfconv7
keywords: smallprint printgap noloewdin
keywords: NOSOSCF
formula: C18H20ClNO5
InChI: InChI=1/C18H20ClNO5/c1-9-7-12(22-3)16(23-4)17(24-5)13(9)15(21)14-10(2)11(19)8-20-18(14)25-6/h7-8H,1-6H3
45 atoms
Cl 4.868332 1.457575 0.218619
O  -0.159309 1.276171 0.983905
O  -2.721955 2.250205 0.664689
O  -4.789829 0.404753 0.094379
O  0.769077 -2.306525 1.54466
O  0.495386 -1.597688 -1.905531
N  2.365004 -0.325408 -2.24291
C  -0.905994 -0.93255 0.598114
C  -1.95549 -1.838941 0.390056
C  -1.172929 0.433539 0.661444
C  0.492448 -1.404294 0.793803
C  1.558245 -0.738261 -0.023274
C  -2.471817 0.92098 0.510773
C  -3.230426 -1.338817 0.185687
C  -3.504668 0.024075 0.244691
C  2.617339 -0.039277 0.535307
C  -1.732139 -3.322436 0.326919
C  1.497662 -0.865031 -1.41929
C  3.530978 0.528191 -0.361622
C  2.777693 0.16442 2.007302
C  3.366592 0.368749 -1.720252
C  0.222475 2.233139 0.008809
C  -3.03454 2.612772 1.99902
C  -5.09435 1.470864 -0.786809
C  0.361622 -1.699974 -3.310176
H  -4.052061 -2.015095 -0.014394
H  -1.489476 -3.730665 1.306691
H  -2.627487 -3.826049 -0.034463
H  -0.911075 -3.581614 -0.340851
H  1.983328 -0.294332 2.584381
H  3.724682 -0.256309 2.345898
H  2.799726 1.228474 2.243499
H  4.067924 0.817061 -2.414136
H  -0.511099 3.033005 -0.092604
H  1.167563 2.658054 0.342677
H  0.381315 1.770834 -0.96897
H  -3.21389 3.686653 2.005561
H  -2.209939 2.389292 2.680198
H  -3.933439 2.103365 2.356818
H  -5.0882 2.439949 -0.287874
H  -6.097317 1.280764 -1.167084
H  -4.405113 1.510834 -1.633313
H  1.22714 -2.181694 -3.766671
H  -0.524229 -2.307269 -3.477526
H  0.225837 -0.723265 -3.776874
totalener: -1589.09370095 hartree
nucrepener: 2521.87489278 hartree
electener: -4110.96859372 hartree
oneelecener: -7190.19969621 hartree
twoeener: 3079.23110248 hartree
kineticenergy: 1583.77582813 hartree
xcener: -128.269335520156 hartree
chargesum: -0.0000000
charge: -0.076074 -0.333369 -0.373405 -0.315415 -0.299107 -0.282941 -0.360085 -0.018556 -0.033497 0.174054 0.136996 0.092736 0.211521 -0.177727 0.189621 -0.041216 -0.230152 0.334743 0.043044 -0.231417 -0.024712 -0.140667 -0.120942 -0.100794 -0.124434 0.101213 0.116395 0.077250 0.096494 0.100652 0.116703 0.092505 0.110787 0.127830 0.108163 0.101068 0.112464 0.108571 0.107858 0.093656 0.112358 0.097273 0.108232 0.110106 0.102219
qa: -0.0761 -0.3334 -0.3734 -0.3154 -0.2991 -0.2829 -0.3601 -0.0186 -0.0335 0.1741 0.1370 0.0927 0.2115 -0.1777 0.1896 -0.0412 -0.2302 0.3347 0.0430 -0.2314 -0.0247 -0.1407 -0.1209 -0.1008 -0.1244 0.1012 0.1164 0.0772 0.0965 0.1007 0.1167 0.0925 0.1108 0.1278 0.1082 0.1011 0.1125 0.1086 0.1079 0.0937 0.1124 0.0973 0.1082 0.1101 0.1022
va: 1.2506 1.9923 1.9362 2.0523 2.1531 2.1082 3.0404 3.4574 3.8392 3.8943 3.9782 3.3688 3.6949 4.0334 4.0044 3.7488 3.8958 3.9642 3.8519 3.9579 4.1556 3.8865 3.8622 3.8888 3.8978 1.0215 1.0058 1.0037 1.0073 1.0184 1.0012 1.0014 1.0108 1.0047 0.9869 0.9864 0.9944 0.9936 0.9882 0.9850 0.9942 0.9941 0.9983 0.9927 1.0007
dispcorr: -0.027391357 hartree
energy: -1589.121092304174
dipole: -25.05892 24.15304 -0.90588 1.29591 -0.36192 0.93399 -2.45601 1.74902 -0.70698
magnitude: 1.48080 au
magnitude: 3.76390 debye
