program: Orca
programVersion: 5.0.2
elementType: Cl O O O O O N C C C C C C C C C C C C C C C C C C H H H H H H H H H H H H H H H H H H H H
charge: 0
multiplicity: 1
keywords: wb97x-d3
keywords: def2-TZVPP
keywords: def2/J RIJCOSX
keywords: DEFGRID2
keywords: scfconv7
keywords: smallprint printgap noloewdin
keywords: NOSOSCF
formula: C18H20ClNO5
InChI: InChI=1/C18H20ClNO5/c1-9-7-12(22-3)16(23-4)17(24-5)13(9)15(21)14-10(2)11(19)8-20-18(14)25-6/h7-8H,1-6H3
45 atoms
Cl 4.940527 1.357656 0.254071
O  -0.161738 1.290943 0.94374
O  -2.731711 2.258483 0.632275
O  -4.800443 0.402013 0.11122
O  0.767502 -2.286835 1.548813
O  0.475595 -1.52973 -1.915666
N  2.381918 -0.307887 -2.232531
C  -0.910125 -0.921779 0.597168
C  -1.958974 -1.832821 0.408144
C  -1.178807 0.444728 0.643291
C  0.489646 -1.38786 0.793993
C  1.559926 -0.726123 -0.019932
C  -2.479468 0.927653 0.49588
C  -3.236807 -1.33794 0.208515
C  -3.512944 0.024898 0.252446
C  2.634822 -0.059178 0.548396
C  -1.732847 -3.316449 0.358985
C  1.497731 -0.833154 -1.41738
C  3.569545 0.487456 -0.339388
C  2.794607 0.124203 2.023262
C  3.403384 0.348572 -1.700166
C  0.202674 2.243326 -0.042474
C  -3.040059 2.637625 1.963244
C  -5.11617 1.449518 -0.788166
C  0.346413 -1.61269 -3.321905
H  -4.058962 -2.018026 0.024205
H  -2.628935 -3.825347 0.00686
H  -0.914648 -3.58053 -0.310497
H  -1.484482 -3.714661 1.341484
H  2.949288 1.176326 2.26159
H  1.937347 -0.228322 2.58541
H  3.67308 -0.416286 2.377896
H  4.120667 0.780968 -2.387783
H  0.295418 1.785506 -1.030799
H  -0.508539 3.067299 -0.100583
H  1.177429 2.633571 0.245678
H  -2.211101 2.427192 2.6437
H  -3.934776 2.128606 2.331921
H  -3.224823 3.710876 1.956199
H  -6.123715 1.251825 -1.152321
H  -4.436883 1.472429 -1.643585
H  -5.104526 2.428745 -0.309477
H  -0.554073 -2.194733 -3.500634
H  0.238465 -0.627665 -3.778472
H  1.201505 -2.111244 -3.780054
totalener: -1589.09370845 hartree
nucrepener: 2519.93650459 hartree
electener: -4109.03021303 hartree
oneelecener: -7186.35184804 hartree
twoeener: 3077.32163500 hartree
kineticenergy: 1583.77408581 hartree
xcener: -128.268722167503 hartree
chargesum: -0.0000000
charge: -0.076398 -0.332317 -0.372952 -0.316005 -0.299548 -0.282606 -0.359233 -0.019180 -0.033578 0.170934 0.133871 0.096552 0.216639 -0.179382 0.191056 -0.037145 -0.229047 0.328847 0.040195 -0.233673 -0.021755 -0.143492 -0.121282 -0.100605 -0.125135 0.101196 0.077255 0.096689 0.116112 0.091316 0.099578 0.119863 0.110901 0.101160 0.127891 0.110531 0.108741 0.107943 0.112619 0.112392 0.097161 0.093489 0.110795 0.101634 0.107971
qa: -0.0764 -0.3323 -0.3730 -0.3160 -0.2995 -0.2826 -0.3592 -0.0192 -0.0336 0.1709 0.1339 0.0966 0.2166 -0.1794 0.1911 -0.0371 -0.2290 0.3288 0.0402 -0.2337 -0.0218 -0.1435 -0.1213 -0.1006 -0.1251 0.1012 0.0773 0.0967 0.1161 0.0913 0.0996 0.1199 0.1109 0.1012 0.1279 0.1105 0.1087 0.1079 0.1126 0.1124 0.0972 0.0935 0.1108 0.1016 0.1080
va: 1.2501 1.9943 1.9365 2.0512 2.1528 2.1057 3.0409 3.4645 3.8445 3.9024 3.9682 3.3724 3.6906 4.0355 4.0015 3.7517 3.8961 3.9651 3.8549 3.9581 4.1540 3.8900 3.8618 3.8889 3.8986 1.0216 1.0037 1.0069 1.0057 1.0031 1.0169 0.9998 1.0108 0.9863 1.0037 0.9867 0.9933 0.9883 0.9944 0.9942 0.9941 0.9851 0.9928 1.0004 0.9984
dispcorr: -0.027294715 hartree
energy: -1589.121003163931
dipole: -25.35676 24.44271 -0.91405 1.58784 -0.65312 0.93472 -2.63584 1.92020 -0.71564
magnitude: 1.49042 au
magnitude: 3.78834 debye
