program: Gaussian 09
title: 000066088
version: EM64L-G09RevD.01
frameworkgroup: C1[X(C9H12O)]
method: RPBEPBE
basis: SDD
operation: Freq
keyword: #pfreq=noraman
keyword: PBEPBE/SDD
title: #p freq=noraman PBEPBE/SDD
converged: YES YES NO NO
title: Mulliken charges:
elementType: O C C C C C C C C C H H H H H H H H H H H H
charge: -0.294189 0.009461 0.343134 0.343078 -0.391883 -0.391655 -0.235001 -0.810759 -0.810905 -0.514820 0.231677 0.231670 0.223031 0.255548 0.222716 0.223025 0.222722 0.255561 0.223098 0.215889 0.215942 0.232659
chargesum: 0.00000
title: Mulliken charges with hydrogens summed into heavy atoms:
elementType: O C C C C C C C C C
charge: -0.294189 0.009461 0.343134 0.343078 -0.160207 -0.159985 -0.011970 -0.109471 -0.109523 0.149671
polarizability: 1.18509090e+02 -3.04594735e-03 1.16531163e+02 3.59204374e+00 -5.25108876e-03 5.70469676e+01
1716.lowfreq: -24.1318 -0.0008 -0.0006 -0.0004 10.6883 12.0823 34.4394 86.9126 93.7870
frequency: 29.9726 86.8807 93.4850 106.3866 144.2489 189.1062 220.8593 267.9427 303.2479 347.8857 464.7464 477.9654 510.7687 537.7436 565.6609 634.0557 757.8568 775.9516 784.5180 897.0457 916.3863 959.8012 970.6228 978.0243 1031.6223 1045.1084 1047.5198 1088.0823 1113.4950 1146.5454 1170.4781 1174.4317 1256.0813 1272.1909 1366.8078 1393.2309 1394.5590 1413.5192 1448.5119 1454.6550 1455.8514 1463.3811 1464.2552 1469.7550 1484.4299 1488.7537 1596.8775 1603.8523 2953.4540 2973.4741 2974.2644 3037.3036 3056.4860 3056.6720 3097.1726 3097.5089 3107.7137 3117.0165 3126.0601 3153.8146
redmass: 1.7014 1.0369 1.2964 3.0317 1.0658 3.0802 3.0336 2.6797 3.7969 3.4452 3.4326 5.4379 3.0718 5.5842 3.4305 4.4155 4.3759 1.3751 3.5091 1.3149 2.5295 7.1405 1.3590 1.6128 1.8168 1.5450 1.5212 1.7757 1.2426 1.4844 3.6993 1.1580 1.5971 3.2390 7.4036 1.2404 1.2688 1.6037 1.4224 2.0628 1.0693 1.0585 1.0565 1.1156 1.1903 1.1694 5.6150 7.5170 1.0315 1.0410 1.0409 1.1037 1.0919 1.0918 1.1000 1.0999 1.1005 1.0856 1.0920 1.0991
irintensity: 4.1070 0.5549 0.7378 0.7803 0.3637 8.3169 0.0014 2.8645 9.4812 7.7286 1.2879 1.5449 0.3681 0.0482 1.4572 2.7563 2.4822 41.8207 23.4493 0.1995 2.6166 43.7385 1.7284 4.1710 6.6950 12.5157 3.4216 39.7495 0.0536 5.7835 82.7800 1.1088 1.1975 9.5799 0.3848 22.2806 5.3790 11.5704 13.6326 0.7497 7.0027 27.8470 4.0192 5.0039 14.9568 51.6573 1.5971 2.8449 62.9511 49.2418 19.5730 56.5147 6.3214 41.4986 5.2223 16.3164 30.5046 0.0531 28.3050 31.6463
temp: 298.150 k
press: 1.00000 atm
elementType: 8 6 6 6 6 6 6 6 6 6 1 1 1 1 1 1 1 1 1 1 1 1
symmnumber: 1
zpe: 482191.3 jmol-1
zpe.correction: 0.183657 hartree
zpe.thermalcorrener: 0.194627 hartree
zpe.thermalcorrenthalpy: 0.195571 hartree
zpe.thermalcorrgfe: 0.146442 hartree
zpe.sumelectzpe: -424.612786 hartree
zpe.sumelectthermal: -424.601816 hartree
zpe.sumelectthermalent: -424.600872 hartree
zpe.sumelectthermalfe: -424.650002 hartree
dipole: -0.4666 -0.0016 1.6256
dipole: 1.6912
quadrupole: -54.5767 -54.3209 -63.9620
quadrupole: 0.0053 -2.9683 0.0061
quadrupole: 3.0432 3.2989 -6.3421 0.0053 -2.9683 0.0061
hfenergy: -424.7964434 hartree
pointgroup: C01 [X(C9H12O1)]
dipole: 0.1781542 -0.0011681 -0.6410786 debye
dipolederiv: -1.2521494 0.0016654 0.1934983 0.0020914 -0.4180785 -0.0004834 0.086844 -0.000115 -0.3807109 0.9880041 -0.001755 -0.0527356 -0.0016729 0.0226046 -0.0000043 0.1856044 -0.0003614 -0.0718039 -0.0613597 0.1301455 0.0347703 0.212224 0.2116373 0.0318603 -0.0167685 -0.0202115 -0.03593 -0.0625916 -0.1289315 0.0346383 -0.2112016 0.2127473 -0.0319241 -0.0170104 0.0202566 -0.0361032 -0.0558961 -0.1218019 0.0255908 -0.06099 -0.022585 -0.0213275 0.0304178 -0.0167007 -0.1819847 -0.0552245 0.1218917 0.0256761 0.061088 -0.0231935 0.0212999 0.0304848 0.0166759 -0.1819677 0.0752931 -0.0001232 0.0356306 -0.0001449 -0.0160988 -0.0000227 0.0349353 -0.0000189 -0.1474431 -0.016167 -0.0998327 -0.03072 -0.0929673 -0.0845511 -0.0087268 -0.016143 0.0526825 0.0705681 -0.0154742 0.098911 -0.0306852 0.0926488 -0.0856293 0.0088623 -0.0163321 -0.0527569 0.0706935 0.5506036 -0.0004547 -0.1753617 -0.0009916 0.3070011 0.000321 -0.3771668 0.0005837 0.4176453 0.0328822 0.0752596 -0.0156624 0.1027037 -0.0914304 0.0107937 -0.0192087 0.0026332 0.1509587 0.0322724 -0.0756687 -0.0157173 -0.1031091 -0.0908165 -0.0107988 -0.0191947 -0.0026183 0.1509409 -0.1398967 0.0003683 -0.0445452 0.0003685 0.0785823 0.0000646 -0.0455971 0.0000476 0.1519358 -0.0081292 -0.0397549 -0.1020317 0.002955 0.0892071 0.0380068 -0.1012517 -0.0258645 0.0260391 0.0443749 -0.0867556 0.0778034 -0.0611304 0.0158598 0.0241786 0.1019763 0.0803405 -0.0855889 -0.0103432 0.1449865 0.0617112 0.0553448 -0.0606693 -0.0565039 0.026181 -0.0698384 0.0875327 0.0452542 0.0866861 0.0773295 0.0611144 0.0152172 -0.0247526 0.1013894 -0.0809512 -0.0857662 -0.0084761 0.0401199 -0.1020373 -0.0028621 0.0893018 -0.037721 -0.1010627 0.0260723 0.02646 -0.0108808 -0.1447996 0.0622268 -0.0553518 -0.0598084 0.0565666 0.0266521 0.0702165 0.0872508 0.0532051 0.0545395 -0.0146958 -0.019189 -0.0992147 0.1411224 0.0825319 0.1029218 -0.04507 0.053116 -0.0554494 -0.0155038 0.0182332 -0.0989607 -0.1409415 0.0816726 -0.1032018 -0.0448954 -0.1784172 0.000754 -0.0291794 0.000839 0.1088778 0.0001306 -0.0589541 0.000208 0.0572391 unknown
polarizability: 118.5655969|-0.004451|116.5311671|3.0702327|0.001668|56.9904567 unknown
InChI: InChI=1S/C9H12O/c1-7-5-4-6-8(2)9(7)10-3/h4-6H,1-3H3
charge 0 multiplicity 1
22 atoms
O  1.830111 -0.002646 0.465896
C  0.432644 -0.000495 0.176158
C  -0.242534 1.246725 0.075791
C  -0.246648 -1.245446 0.075479
C  -1.64265 1.226069 -0.143048
C  -1.6467 -1.220086 -0.143423
C  -2.341243 0.004151 -0.258863
C  0.514748 2.554637 0.214255
C  0.506147 -2.555957 0.213953
C  2.693933 -0.005538 -0.726517
H  -2.184593 2.176886 -0.214958
H  -2.191774 -2.169097 -0.215533
H  -3.424581 0.005966 -0.42321
H  1.346653 2.451278 0.931072
H  0.952634 2.87463 -0.752066
H  -0.154057 3.3639 0.554744
H  0.940839 -2.878778 -0.752872
H  1.339819 -2.454741 0.929017
H  -0.16492 -3.362345 0.556817
H  2.524396 0.897271 -1.345892
H  2.518994 -0.90752 -1.345578
H  3.728883 -0.008564 -0.350122
