program: Orca
programVersion: 5.0.2
elementType: Cl F F N N C C C C C C C C C C C C C C C C C H H H H H H H H H H H
charge: 0
multiplicity: 1
keywords: wb97x-d3
keywords: def2-TZVPP
keywords: def2/J RIJCOSX
keywords: DEFGRID2
keywords: scfconv7
keywords: smallprint printgap noloewdin
keywords: NOSOSCF
formula: C17H11ClF2N2
InChI: InChI=1/C17H11ClF2N2/c1-10-14(11-6-3-2-4-7-11)16(17(18)22-21-10)15-12(19)8-5-9-13(15)20/h2-9H,1H3
33 atoms
Cl 3.347364 -0.720493 0.414141
F  -0.193635 0.913899 2.276968
F  1.702821 0.933459 -1.978965
N  0.59767 -3.332444 -0.031026
N  1.748773 -2.721408 0.134469
C  -0.544598 -1.239247 -0.076165
C  0.664761 -0.593298 0.085647
C  -1.801197 -0.473374 -0.211583
C  0.767792 0.875393 0.151816
C  -0.527723 -2.648308 -0.131741
C  1.788259 -1.419006 0.187197
C  -1.992217 0.363782 -1.308337
C  -2.794846 -0.57008 0.758684
C  0.324887 1.594742 1.251113
C  1.297832 1.609008 -0.898927
C  -1.76978 -3.451478 -0.334056
C  0.39866 2.970722 1.321376
C  1.395532 2.983504 -0.879643
C  -3.165611 1.091558 -1.434481
C  -3.965611 0.16251 0.631744
C  0.940835 3.656862 0.245279
C  -4.153714 0.993157 -0.464404
H  -1.227494 0.437539 -2.071759
H  -2.650563 -1.211217 1.61931
H  -2.391805 -3.457497 0.562054
H  -2.377551 -3.051317 -1.145622
H  -1.511336 -4.482348 -0.56777
H  0.042194 3.492823 2.199093
H  1.813142 3.515576 -1.723721
H  -3.306197 1.73692 -2.291808
H  -4.730983 0.08555 1.39309
H  1.007905 4.735542 0.282114
H  -5.068566 1.563206 -0.562449
elementType: Cl F N C H
totalener: -1423.89721080 hartree
nucrepener: 1933.11328719 hartree
electener: -3357.01049799 hartree
oneelecener: -5792.24993816 hartree
twoeener: 2435.23944017 hartree
cpcmener: -0.02258964 hartree
kineticenergy: 1419.38779863 hartree
xcener: -111.979806795902 hartree
chargesum: -0.0000000
charge: -0.040984 -0.209003 -0.209917 -0.139407 -0.181813 0.289329 0.051842 -0.097610 -0.297161 0.083147 0.167016 -0.184775 -0.180298 0.354494 0.341235 -0.259566 -0.267720 -0.254137 -0.176711 -0.171937 -0.063647 -0.128885 0.153471 0.153237 0.112856 0.114343 0.105199 0.149960 0.150015 0.156760 0.156365 0.165504 0.158796
qa: -0.0410 -0.2090 -0.2099 -0.1394 -0.1818 0.2893 0.0518 -0.0976 -0.2972 0.0831 0.1670 -0.1848 -0.1803 0.3545 0.3412 -0.2596 -0.2677 -0.2541 -0.1767 -0.1719 -0.0636 -0.1289 0.1535 0.1532 0.1129 0.1143 0.1052 0.1500 0.1500 0.1568 0.1564 0.1655 0.1588
va: 1.2839 1.0878 1.0778 2.9465 2.9570 3.2495 3.4394 3.2388 3.4933 3.9496 4.2075 3.9088 3.9091 3.8608 3.8184 3.9754 3.9865 3.9901 3.9347 3.9261 3.8065 3.8804 1.0005 1.0011 0.9955 0.9934 1.0201 1.0031 1.0028 0.9941 0.9932 0.9851 0.9898
dispcorr: -0.018415427 hartree
energy: -1423.915626232068
dipole: -25.06018 22.82243 -2.23776 2.39932 0.14417 2.54349 -3.13538 2.96199 -0.17339
magnitude: 3.39219 au
magnitude: 8.62227 debye
