program: Gaussian 09
title: 000066087
version: EM64L-G09RevD.01
frameworkgroup: C1[X(C5H3NS)]
method: RPBEPBE
basis: SDD
operation: Freq
keyword: #pfreq=noraman
keyword: PBEPBE/SDD
title: #p freq=noraman PBEPBE/SDD
converged: NO NO NO NO
title: Mulliken charges:
elementType: S N C C C C C H H H
charge: 0.300202 -0.021505 -0.214466 -0.142803 -0.110915 -0.496020 -0.120298 0.275481 0.255789 0.274535
chargesum: 0.00000
title: Mulliken charges with hydrogens summed into heavy atoms:
elementType: S N C C C C C
charge: 0.300202 -0.021505 0.061014 -0.142803 0.144874 -0.221484 -0.120298
polarizability: 1.12106693e+02 -2.47050528e+00 7.08686570e+01 -7.27051338e-03 -1.83220830e-03 2.76532617e+01
1716.lowfreq: -9.0248 -7.2860 -0.0020 -0.0020 -0.0016 8.2408 156.3144 160.3336 398.9819
frequency: 156.3097 160.3270 398.9809 466.6435 503.0257 528.9834 577.9032 648.7085 695.4315 715.9254 820.3709 846.6828 923.4517 1036.9171 1083.3191 1143.0238 1228.5250 1337.3901 1460.4156 1527.4403 2167.4116 3182.4075 3199.6466 3239.4253
redmass: 6.3522 9.1124 6.5449 11.5696 11.4670 4.7877 3.8858 8.3694 7.7545 1.1665 4.8391 1.3009 1.3775 1.8854 1.2873 2.6367 1.4248 2.3917 7.2373 5.5840 12.5995 1.0900 1.0986 1.1006
irintensity: 0.2252 2.0276 0.2237 1.2135 0.2643 2.9837 3.9335 3.0688 1.9181 112.8475 13.2058 17.9640 0.5795 10.7643 6.5093 10.9306 16.4696 0.0967 20.4238 0.4538 41.7781 2.4587 0.6596 0.7307
temp: 298.150 k
press: 1.00000 atm
elementType: 16 7 6 6 6 6 6 1 1 1
symmnumber: 1
zpe: 167768.3 jmol-1
zpe.correction: 0.063900 hartree
zpe.thermalcorrener: 0.069807 hartree
zpe.thermalcorrenthalpy: 0.070751 hartree
zpe.thermalcorrgfe: 0.033671 hartree
zpe.sumelectzpe: -644.626101 hartree
zpe.sumelectthermal: -644.620193 hartree
zpe.sumelectthermalent: -644.619249 hartree
zpe.sumelectthermalfe: -644.656329 hartree
dipole: -4.7147 1.0059 0.0005
dipole: 4.8208
quadrupole: -54.4473 -42.3452 -50.0291
quadrupole: 0.2228 -0.0005 -0.0002
quadrupole: -5.5068 6.5953 -1.0886 0.2228 -0.0005 -0.0002
hfenergy: -644.6900004 hartree
pointgroup: C01 [X(C5H3N1S1)]
dipole: -1.8751564 -0.2847357 -0.0001846 debye
dipolederiv: 0.0191711 -0.1235723 -0.0000212 -0.0550673 -0.1990618 0.0000235 -0.0000294 0.0000248 0.1908918 -0.4681708 0.0021918 -0.000123 -0.0169863 -0.2118006 -0.0000045 -0.000041 -0.0000007 -0.239614 0.1618977 -0.1632962 0.0000366 0.0708356 -0.1210837 0.0000206 -0.0000037 -0.0000062 -0.1189319 -0.2366739 -0.1126562 0.0000161 -0.2639288 0.4752765 -0.0000693 -0.0000181 -0.0000498 -0.0945514 -0.0921558 0.1464884 0.0000055 0.1478458 -0.2216998 0.0000369 0.0000116 0.0000404 -0.1402971 -0.0688097 0.2436448 0.0000169 0.0781616 0.2554458 -0.0000328 0.0000401 -0.0000274 -0.3011858 0.5318251 0.0105126 0.00013 0.0770546 -0.0936398 0.0000152 0.0001126 0.0000077 0.0790003 0.1034813 0.0300615 -0.0000137 0.0554284 0.0022367 0.0000098 -0.0000099 0.0000035 0.2046485 0.0245299 -0.0622202 -0.0000192 -0.0964392 0.0325558 -0.0000119 -0.0000244 -0.0000136 0.2011153 0.024905 0.0288459 -0.000028 0.0030957 0.0817708 0.0000126 -0.0000377 0.0000213 0.2189243 unknown
polarizability: 112.2541685|0.0052436|70.721181|0.0071487|-0.0022613|27.6532617 unknown
InChI: InChI=1S/C5H3NS/c6-4-5-2-1-3-7-5/h1-3H
charge 0 multiplicity 1
10 atoms
S  -0.598489 1.50057 -0.000214
N  2.980034 0.012175 0.000131
C  -0.474226 -1.154577 -0.00005
C  0.364845 -0.038083 0.000027
C  -1.870492 -0.820821 -0.00023
C  -2.110375 0.546261 -0.000299
C  1.781056 -0.011229 0.000238
H  -0.084562 -2.174695 0.000007
H  -2.66893 -1.565752 -0.000334
H  -3.063762 1.07185 -0.000476
